program: Gaussian 09
title: 000008342
version: EM64L-G09RevD.01
frameworkgroup: C1[X(C10H4Cl2O2)]
method: RPBEPBE
basis: SDD
operation: Freq
keyword: #p
keyword: freq=noraman
keyword: PBEPBE/SDD
title: #p freq=noraman PBEPBE/SDD
converged: NO NO NO NO
title: Mulliken charges:
elementType: Cl Cl O O C C C C C C C C C C H H H H
charge: 0.082960 0.082990 -0.157749 -0.157746 0.280168 0.280166 0.069687 0.069667 -0.351548 -0.351549 -0.243344 -0.243403 -0.219321 -0.219323 0.292195 0.292195 0.246978 0.246978
chargesum: 0.00000
title: Mulliken charges with hydrogens summed into heavy atoms:
elementType: Cl Cl O O C C C C C C C C C C
charge: 0.082960 0.082990 -0.157749 -0.157746 0.280168 0.280166 0.069687 0.069667 -0.059353 -0.059355 -0.243344 -0.243403 0.027657 0.027655
polarizability: 1.94095728e+02 1.92691573e-04 1.69138315e+02 -9.14349922e-05 -2.55491395e-03 4.76535796e+01
1716.lowfreq: -3.1240 -2.4734 -0.0001 0.0027 0.0029 8.5091 53.3468 70.0304 124.2808
frequency: 53.3412 70.0199 124.2770 161.9695 195.0860 206.1511 266.8146 274.2894 322.8035 340.7039 370.1101 415.6977 424.2876 465.9339 515.7451 535.3135 629.9387 679.3190 686.9943 721.0569 791.9420 806.9944 823.5987 847.6151 847.6765 933.3944 999.4573 1016.7146 1021.9859 1073.9159 1082.6579 1113.9931 1175.4504 1228.9381 1260.2287 1280.5006 1400.7998 1438.2773 1470.3747 1543.3137 1560.7705 1563.5538 1596.3527 1606.9669 3141.1662 3155.0363 3165.2592 3174.8335
redmass: 11.0833 15.3685 5.0144 8.2988 30.6074 9.1662 7.3380 9.0713 14.9650 16.8431 11.2634 6.7619 3.3804 13.5949 5.6979 8.7066 7.3632 8.6386 4.7258 2.8415 9.0316 1.6858 10.7933 3.6149 7.8995 1.6575 1.3947 1.3684 3.0677 4.7558 3.0868 2.4447 1.0721 2.3287 4.8601 1.8819 10.1487 2.3667 2.6211 9.8051 12.5392 9.8920 8.2932 7.1389 1.0867 1.0905 1.0948 1.1005
irintensity: 4.8262 0.0000 0.0000 1.2748 0.0057 0.3556 0.4146 0.2893 0.3172 1.2548 12.1094 0.0000 1.6192 11.4098 0.0000 0.1944 24.3639 0.0533 0.0000 69.8910 106.6801 35.7386 16.4805 0.0269 21.8964 0.0000 3.4720 0.0000 1.4488 29.1867 0.0005 125.3902 4.6587 24.8678 293.7522 5.0573 0.0754 1.8404 3.4645 96.0873 108.9601 255.4698 5.2387 13.3308 3.4015 3.3181 0.4965 20.7386
temp: 298.150 k
press: 1.00000 atm
elementType: 17 17 8 8 6 6 6 6 6 6 6 6 6 6 1 1 1 1
symmnumber: 1
zpe: 290582.6 jmol-1
zpe.correction: 0.110677 hartree
zpe.thermalcorrener: 0.122002 hartree
zpe.thermalcorrenthalpy: 0.122946 hartree
zpe.thermalcorrgfe: 0.072223 hartree
zpe.sumelectzpe: -1453.058599 hartree
zpe.sumelectthermal: -1453.047274 hartree
zpe.sumelectthermalent: -1453.046330 hartree
zpe.sumelectthermalfe: -1453.097053 hartree
dipole: -4.0718 0.0002 -0.0007
dipole: 4.0718
quadrupole: -75.5204 -105.5710 -93.3774
quadrupole: 0.0005 0.0011 -0.0017
quadrupole: 15.9692 -14.0814 -1.8879 0.0005 0.0011 -0.0017
hfenergy: -1453.1692759 hartree
pointgroup: C01 [X(C10H4Cl2O2)]
dipole: 1.6019635 0.0000424 0.0002692 debye
dipolederiv: -0.5798422 -0.4251709 -0.0000028 -0.3461654 -0.2430518 0.0000011 0.0000177 0.0000052 0.0216078 -0.579796 0.4251892 0.0001176 0.346175 -0.2430683 -0.0000686 0.0001542 -0.0000963 0.0216291 -0.5502456 0.0312844 -0.0000015 -0.0883269 -0.9278532 -0.0001307 0.0000042 0.0000169 -0.2879515 -0.5502499 -0.0312918 -0.0000061 0.0883165 -0.9278779 0.0000903 -0.0000162 0.0000963 -0.2879514 -0.5346382 -0.2286727 -0.0000019 -0.2793583 -0.0765896 -0.0000161 0.000028 -0.0000201 0.0113464 -0.5346452 0.2286892 -0.0000274 0.2793775 -0.0766206 0.0000662 -0.0000426 0.0000222 0.0113421 1.3386021 -0.2828745 -0.0000327 -0.0694024 1.0082957 0.0001273 -0.0000349 0.0000298 0.208174 1.3386288 0.2828671 0.0000456 0.0693649 1.0083191 -0.0002148 0.0000479 -0.0001408 0.2081802 -0.1728109 0.1285131 -0.000007 -0.1278356 0.1017066 -0.0000001 -0.0000245 0.0000145 -0.0909985 -0.1727973 -0.1285145 -0.0000115 0.1278398 0.1017082 0.0000141 -0.0000441 -0.0000104 -0.0909982 0.2494513 1.0039515 0.000092 1.1216039 0.105697 -0.0000493 0.0001076 -0.0000699 -0.0442863 0.2493793 -1.0039675 -0.0001924 -1.1215863 0.1057885 0.0001867 -0.000232 0.0001536 -0.0442974 0.1847888 -0.1536864 0.0000338 -0.0410358 -0.0353232 0.0000002 0.0000434 -0.0000175 -0.1330863 0.1847937 0.1536824 0.0000417 0.0410313 -0.0353408 0.0000089 0.0000295 0.0000205 -0.1330868 0.1235668 -0.0442899 -0.0000067 0.0244697 0.0127163 0. -0.0000141 -0.0000046 0.1561861 0.1235662 0.044288 -0.0000007 -0.0244727 0.0127152 -0.0000099 0.0000273 0.000007 0.1561863 -0.0588732 0.0722266 -0.0000185 0.0821438 0.0543862 0.0000064 -0.0000171 0.0000089 0.159002 -0.0588785 -0.0722233 -0.0000215 -0.082139 0.0543926 -0.0000116 -0.0000341 -0.0000153 0.1590024 unknown
polarizability: 194.0957276|-0.0004745|169.1383154|-0.0000914|0.0025549|47.6535796 unknown
InChI: InChI=1S/C10H4Cl2O2/c11-7-8(12)10(14)6-4-2-1-3-5(6)9(7)13/h1-4H
charge 0 multiplicity 1
18 atoms
Cl -3.281156 -1.636929 0.000024
Cl -3.281091 1.63699 0.000443
O  -0.514304 -2.751888 -0.000134
O  -0.514232 2.751877 -0.000397
C  0.786648 -0.71127 -0.000059
C  0.786674 0.711226 -0.000038
C  -0.491737 -1.488719 -0.000214
C  -0.491684 1.488711 -0.000092
C  2.013088 -1.416465 0.000032
C  2.013135 1.416386 0.000095
C  -1.766951 -0.686872 -0.000017
C  -1.766949 0.6869 0.00006
C  3.234743 -0.708651 0.000163
C  3.234768 0.708534 0.000181
H  1.989529 -2.510671 0.000003
H  1.989603 2.510594 0.000102
H  4.182634 -1.256962 0.000252
H  4.182681 1.25681 0.000296
