program: Gaussian 09
title: 000008341
version: EM64L-G09RevD.01
frameworkgroup: C1[X(C14H9NO2)]
method: RPBEPBE
basis: SDD
operation: Freq
keyword: #p
keyword: freq=noraman
keyword: PBEPBE/SDD
title: #p freq=noraman PBEPBE/SDD
converged: YES YES YES YES
title: Mulliken charges:
elementType: O O N C C C C C C C C C C C C C C H H H H H H H H H
charge: -0.200558 -0.211150 -0.686938 0.301650 0.278739 0.258663 0.273408 -0.228936 -0.217357 -0.586787 -0.369919 -0.374176 -0.377252 0.539507 -0.435204 -0.229932 -0.226294 0.284063 0.284871 0.288312 0.290748 0.229874 0.238174 0.237980 0.316314 0.322200
chargesum: 0.00000
title: Mulliken charges with hydrogens summed into heavy atoms:
elementType: O O N C C C C C C C C C C C C C C
charge: -0.200558 -0.211150 -0.048425 0.301650 0.278739 0.258663 0.273408 -0.228936 -0.217357 -0.302724 -0.085049 -0.085864 -0.086504 0.539507 -0.205330 0.008243 0.011686
polarizability: 2.94065369e+02 1.10481560e+01 1.85131060e+02 -1.05847580e-02 -8.24030999e-03 6.15605155e+01
1716.lowfreq: -11.8279 -0.0012 -0.0006 -0.0004 5.1819 9.2346 47.9257 96.4585 126.2975
frequency: 47.9248 96.4584 126.2958 148.1038 185.3719 200.9625 270.6732 287.2734 326.8538 371.3580 379.7830 408.6065 426.8926 428.6012 443.9789 448.5182 462.2840 464.9253 561.2524 574.1767 631.2015 655.5456 668.4375 682.5362 727.7620 733.9736 741.0638 807.1403 842.0651 845.8187 874.8467 916.3286 918.7875 955.6828 971.7840 994.7057 998.7714 1014.8107 1031.8356 1041.4452 1080.5040 1102.8115 1156.6574 1168.6686 1179.7672 1226.8414 1255.1896 1284.1152 1309.6727 1347.7746 1393.1516 1406.7316 1438.1268 1463.6269 1468.9500 1500.5425 1528.2122 1548.2163 1565.5110 1597.4867 1606.4219 1632.2846 1648.8537 3129.2720 3134.6357 3138.0980 3149.8138 3160.6268 3160.9671 3170.3901 3557.1109 3696.8942
redmass: 7.0284 4.5490 5.2440 6.3826 4.8361 5.1165 5.9422 4.9287 7.1320 8.4238 5.4517 3.4231 4.7934 1.0427 3.9281 2.2496 1.5424 12.3219 4.2840 6.3493 6.7015 7.0877 3.3108 6.5292 3.0367 2.7844 6.8481 1.8043 1.5842 6.2595 1.9936 7.1851 1.4744 2.3939 2.8636 1.3957 1.4013 1.3776 1.9096 1.5977 3.1239 1.9442 1.4796 1.2173 1.8712 1.6093 1.7193 2.3210 2.4091 4.0066 8.9406 5.6310 2.6278 5.0480 2.7168 4.3167 8.5147 9.1297 7.2304 8.3040 6.3248 4.1510 1.3288 1.0892 1.0861 1.0916 1.0901 1.0951 1.0949 1.1003 1.0453 1.1040
irintensity: 9.7325 0.0549 0.0038 0.0692 3.4396 1.5444 0.0005 2.8880 0.7059 17.6094 6.2444 3.8482 1.2499 19.8622 1.5912 80.1362 211.3075 0.3552 0.9150 7.3311 7.4672 1.6822 9.5491 0.7012 39.7911 41.3931 6.7713 12.6631 31.6717 12.1468 23.0882 29.2339 19.1862 4.2056 16.5447 0.0986 6.2702 0.0220 3.5374 1.8561 1.2561 18.1068 16.9509 20.2709 3.2784 13.8583 14.4847 120.5193 207.6706 511.5761 0.8485 0.5789 2.9530 28.6887 9.5156 14.2155 126.8414 277.4547 36.6053 0.6077 34.3220 86.4360 324.5191 14.7745 4.3362 8.2205 6.2932 7.7890 6.6781 31.6542 150.0269 26.2301
temp: 298.150 k
press: 1.00000 atm
elementType: 8 8 7 6 6 6 6 6 6 6 6 6 6 6 6 6 6 1 1 1 1 1 1 1 1 1
symmnumber: 1
zpe: 507950.9 jmol-1
zpe.correction: 0.193468 hartree
zpe.thermalcorrener: 0.206250 hartree
zpe.thermalcorrenthalpy: 0.207194 hartree
zpe.thermalcorrgfe: 0.154482 hartree
zpe.sumelectzpe: -742.976502 hartree
zpe.sumelectthermal: -742.963721 hartree
zpe.sumelectthermalent: -742.962777 hartree
zpe.sumelectthermalfe: -743.015489 hartree
dipole: -3.3984 -1.1924 0.0004
dipole: 3.6015
quadrupole: -51.2839 -106.7067 -101.8669
quadrupole: 0.6767 -0.0030 0.0011
quadrupole: 35.3353 -20.0876 -15.2477 0.6767 -0.0030 0.0011
hfenergy: -743.1699708 hartree
pointgroup: C01 [X(C14H9N1O2)]
dipole: 1.3298982 0.4889494 0.0001476 debye
dipolederiv: -0.6696898 -0.0271917 -0.0000135 -0.0103841 -0.940854 -0.0000006 -0.0000226 -0.0000926 -0.3134043 -0.7451915 -0.0491224 -0.0000186 -0.3801233 -1.0382118 -0.0000414 -0.0000684 -0.0000877 -0.3220108 -1.6761087 -0.5650933 -0.0000525 -0.7114619 -0.3331436 -0.0000135 -0.0000358 0.0000011 -0.7111156 -0.2309657 0.4808991 0.0000263 0.5936542 0.0552723 0.0000076 0.0000383 0.0000227 0.0418701 -1.2199997 -0.3013939 -0.0000836 -0.4108033 -0.2913678 -0.0000498 -0.0000974 -0.0000143 -0.0269902 -0.6441581 -0.1850919 -0.0000519 -0.3161121 -0.0819293 -0.0000336 -0.0000725 -0.0000216 0.0185428 -0.3585117 0.2283128 0.0000105 0.4182137 -0.1381479 -0.0000153 0.000035 0.000009 0.0318524 1.6311384 -0.0698021 0.0000566 -0.045669 0.9915062 0.00005 0.0000784 0.0000956 0.1221953 1.9623897 0.1074678 0.0000839 0.3452847 1.0152171 0.0000889 0.0001348 0.000091 0.1152047 -0.6946351 -0.4112701 -0.0000427 0.344111 0.0745297 0.0000236 -0.0000131 -0.0000082 -0.1812624 0.4696774 0.1148653 0.0000259 -0.0496561 0.1254921 0.0000022 0.0000095 0.0000082 -0.0733285 -0.1161509 0.1443904 0.000005 -0.0920627 0.0829557 0.0000022 -0.0000035 0.0000145 -0.1086234 -0.2162386 -0.080603 -0.0000058 0.1321714 0.0924559 0.0000127 0.0000035 0.0000056 -0.1137463 1.7773503 0.6543518 0.0001069 0.7075424 0.2199591 0.0000398 0.0001317 0.0000472 0.1575797 -0.2429156 -0.1206299 -0.0000044 -0.6609433 -0.186866 -0.0000284 -0.0000296 -0.0000028 -0.2213002 0.0952568 -0.1588913 -0.0000026 -0.0981928 -0.0300728 0.0000064 -0.000003 0.0000068 -0.1489922 0.1896909 0.1164875 0.0000182 0.0705866 -0.025334 0.0000123 0.0000213 0.0000133 -0.140853 0.1005882 -0.012149 -0.0000035 -0.0619297 -0.0066388 -0.0000111 -0.0000226 -0.0000126 0.1652563 0.1265575 -0.0440684 -0.0000029 0.0339526 -0.004556 -0.0000037 0.0000108 -0.0000087 0.1472191 0.1256408 -0.0455038 -0.0000026 0.0266922 -0.0045277 -0.0000064 0.0000132 -0.0000086 0.155239 0.148164 0.0268822 0.0000014 -0.0474577 -0.0000242 -0.0000092 -0.0000187 -0.0000048 0.155854 -0.1125583 0.0912726 -0.0000098 0.072966 0.039047 -0.0000017 -0.0000136 -0.0000003 0.1668877 -0.0723217 0.0891139 -0.000002 0.1077291 0.0310503 -0.0000042 -0.000004 -0.0000076 0.1576783 -0.1052369 -0.0704672 -0.0000139 -0.0830554 0.0599564 -0.0000084 -0.0000105 -0.0000098 0.1559412 0.2767063 0.037086 -0.000012 -0.0206243 0.1116426 -0.0000117 -0.0000402 -0.0000159 0.3858443 0.2015219 0.0501487 -0.0000123 0.1355716 0.1825895 -0.000007 -0.000021 -0.0000195 0.3844619 unknown
polarizability: 293.7130665|12.6615726|185.4833621|0.0104612|0.0083967|61.5605155 unknown
InChI: InChI=1S/C14H9NO2/c15-8-5-6-11-12(7-8)14(17)10-4-2-1-3-9(10)13(11)16/h1-7H,15H2
charge 0 multiplicity 1
26 atoms
O  -0.060676 2.690853 0.000525
O  -0.539326 -2.818198 0.000036
N  4.743024 0.933881 0.000567
C  1.037404 0.536751 0.00036
C  0.905995 -0.886514 0.000283
C  -1.510959 0.759371 0.000271
C  -1.630089 -0.661817 0.000188
C  -0.171343 1.422722 0.000296
C  -0.418084 -1.547109 0.000226
C  2.309883 1.137593 0.000454
C  2.087342 -1.675747 0.0003
C  -2.678451 1.563127 0.000288
C  -2.915547 -1.255207 0.000107
C  3.489202 0.340832 0.000461
C  3.355773 -1.084876 0.000392
C  -3.953699 0.964091 0.000208
C  -4.072116 -0.449112 0.000118
H  2.362893 2.232386 0.000514
H  1.973348 -2.764576 0.00025
H  -2.555779 2.650892 0.000345
H  -2.976159 -2.348147 0.000047
H  4.25589 -1.711133 0.000415
H  -4.853187 1.5890 0.000214
H  -5.063744 -0.91445 0.000059
H  5.588839 0.370152 0.000629
H  4.840767 1.945735 0.000647
