program: Gaussian 09
title: 000112805
version: EM64L-G09RevD.01
frameworkgroup: C1[X(C18H28O2)]
method: RPBEPBE
basis: SDD
operation: Freq
keyword: #pfreq=noraman
keyword: PBEPBE/SDD
title: #p freq=noraman PBEPBE/SDD
converged: YES YES NO NO
title: Mulliken charges:
elementType: O O C C C C C C C C C C C C C C C C C C H H H H H H H H H H H H H H H H H H H H H H H H H H H H
charge: -0.263563 -0.248421 -0.365877 -0.373473 -0.372226 -0.392688 -0.489859 -0.288474 -0.346051 -0.003663 -0.343395 -0.469108 -0.700224 -0.468158 -0.029657 -0.465495 0.294320 -0.034385 -0.012957 -0.771123 0.235443 0.187147 0.188129 0.194463 0.197408 0.207709 0.214006 0.214044 0.231084 0.226791 0.226550 0.230003 0.205072 0.207030 0.211596 0.190062 0.228807 0.219778 0.215935 0.207005 0.212620 0.227637 0.240490 0.240255 0.227541 0.263789 0.245797 0.248290
chargesum: 0.00000
title: Mulliken charges with hydrogens summed into heavy atoms:
elementType: O O C C C C C C C C C C C C C C C C C C
charge: -0.263563 -0.248421 0.056713 0.009119 0.032890 0.035362 -0.031984 0.168079 0.066050 -0.003663 0.058262 -0.020523 -0.064664 -0.000031 -0.029657 0.002302 0.294320 -0.034385 -0.012957 -0.013248
polarizability: 2.52976395e+02 1.94384771e+00 2.02154200e+02 -3.94464923e+00 -9.06417224e-01 1.46764985e+02
1716.lowfreq: -5.6521 -0.0009 -0.0007 -0.0006 1.5524 4.7587 8.5938 20.1576 23.3978
frequency: 6.5304 20.1022 23.3542 40.6373 43.3233 52.5465 56.6409 60.5455 63.5419 75.1366 87.4318 96.5784 111.0660 117.8196 125.1822 136.2031 159.9746 161.9218 193.0091 211.0353 213.7682 232.1961 240.0929 261.9358 289.4616 296.8442 344.1517 359.6895 377.0108 416.3513 420.6185 461.4860 477.2582 526.1313 552.0921 569.3324 613.4741 670.7790 722.0589 728.4056 734.3418 762.4752 783.7587 819.7790 830.9651 855.8509 891.3932 895.0041 916.1829 918.8714 938.0061 952.2559 982.4589 1003.2690 1005.7095 1009.7839 1040.1158 1044.9519 1048.2233 1068.6112 1077.0679 1099.9346 1101.7863 1106.0784 1107.6045 1147.0694 1155.4176 1172.8948 1183.1373 1194.7852 1200.3069 1209.1255 1216.7416 1226.6613 1250.2393 1253.7081 1267.1268 1274.8972 1284.8074 1290.4215 1293.3921 1299.9426 1308.0300 1320.3205 1323.1753 1339.1744 1341.9063 1351.4359 1363.7409 1372.3182 1384.3758 1388.3159 1454.5282 1455.2418 1456.3208 1456.9702 1457.6460 1458.0984 1461.3954 1465.3734 1467.7425 1470.5807 1477.2803 1478.4136 1480.1018 1487.7668 1490.4697 1645.8437 2277.4857 2278.9280 2954.7114 2956.7345 2962.1294 2964.8950 2965.3851 2970.7922 2972.2506 2974.2811 2980.7426 2984.9016 2990.9060 2997.1232 2998.1776 3001.0528 3005.6682 3011.3588 3012.7132 3020.6436 3022.9105 3037.5106 3040.7159 3048.8863 3049.4048 3065.5487 3070.9551 3074.6651 3099.0852 3138.6758
redmass: 3.8146 6.6019 4.2505 3.7408 3.5457 3.2911 3.8989 1.0619 3.7121 2.5397 1.8233 2.3637 2.6845 2.2827 2.9005 2.4928 2.4714 3.4733 3.0438 4.4623 2.2256 3.1769 1.2239 3.5717 3.0176 3.1527 3.7765 3.6123 3.4157 5.1313 3.6085 3.7894 4.1956 3.5426 3.0487 3.1346 4.7431 2.6030 2.8758 1.0830 1.0950 1.1761 1.1866 1.4761 5.3408 1.7011 1.9082 1.8132 2.0473 1.3213 5.5316 1.6299 2.0739 1.9761 3.2376 2.8050 3.5660 1.6730 3.0118 2.5905 2.1036 2.6243 1.3812 2.1683 1.8027 2.0433 1.3253 2.6949 1.2520 1.2617 3.4272 1.4180 1.1557 1.3439 1.2618 1.3220 1.1919 1.1492 1.1221 1.0809 1.1233 1.2197 1.2954 1.3708 1.4679 1.5148 1.4070 1.5745 1.5993 1.4821 1.2626 1.2240 1.0937 1.0616 1.0820 1.0840 1.0556 1.0795 1.0792 1.0701 1.0778 1.0792 1.0708 1.0428 1.0873 1.0836 1.0966 9.8414 11.6869 11.7117 1.0592 1.0585 1.0600 1.0571 1.0600 1.0380 1.0595 1.0619 1.0598 1.0594 1.0605 1.0962 1.0986 1.0569 1.0384 1.1006 1.0991 1.1005 1.1008 1.1001 1.1035 1.1044 1.1046 1.0991 1.1012 1.1077 1.0937 1.1024
irintensity: 0.0066 1.1107 0.8711 0.0772 0.3380 0.3764 0.4633 0.5886 1.2393 0.4564 0.2675 2.3862 0.9161 0.2487 0.5990 0.5689 3.2382 3.3071 9.7008 2.9313 9.1513 0.9027 1.2056 14.0843 2.7471 3.3639 1.4564 0.8693 0.7264 1.5548 5.5410 0.2209 3.8400 6.4836 4.2302 3.1102 4.0441 0.6509 0.0856 12.3355 11.4139 0.1832 0.7509 2.7049 22.0668 1.6813 2.0639 4.7698 1.9065 2.2125 36.6726 2.9014 3.4547 76.1011 3.4897 1.0058 21.5758 15.8822 1.7208 1.1163 0.3080 7.9826 0.1712 10.6884 0.2444 1.0590 0.8857 0.4490 0.2254 23.3414 347.9871 0.7309 0.1996 1.5611 8.4265 1.4311 0.8475 0.4433 0.3564 0.6910 1.3681 0.8552 7.4909 6.4025 5.2749 10.4065 4.3798 1.1364 2.3164 8.8020 20.5389 32.7591 3.2123 14.1781 14.6643 10.5004 11.9795 5.0780 2.9413 0.9392 0.0254 4.4870 5.2682 17.3554 2.1376 25.3605 6.8828 231.1249 2.6615 0.2196 10.2242 19.4516 10.7129 26.8497 38.4395 32.9185 13.5705 72.5923 68.7872 50.1857 16.5346 5.9316 11.5842 45.7648 4.5486 0.6704 19.6992 12.4233 16.0982 26.0031 9.1757 78.4900 31.9026 59.3917 111.2597 73.8137 8.1170 7.8115
temp: 298.150 k
press: 1.00000 atm
elementType: 8 8 6 6 6 6 6 6 6 6 6 6 6 6 6 6 6 6 6 6 1 1 1 1 1 1 1 1 1 1 1 1 1 1 1 1 1 1 1 1 1 1 1 1 1 1 1 1
symmnumber: 1
zpe: 1086309.0 jmol-1
zpe.correction: 0.413753 hartree
zpe.thermalcorrener: 0.439375 hartree
zpe.thermalcorrenthalpy: 0.440319 hartree
zpe.thermalcorrgfe: 0.352437 hartree
zpe.sumelectzpe: -851.484534 hartree
zpe.sumelectthermal: -851.458912 hartree
zpe.sumelectthermalent: -851.457968 hartree
zpe.sumelectthermalfe: -851.545850 hartree
dipole: -1.1727 0.9139 1.2984
dipole: 1.9740
quadrupole: -124.9429 -118.6698 -123.5591
quadrupole: 8.8046 7.1605 -5.6268
quadrupole: -2.5523 3.7207 -1.1685 8.8046 7.1605 -5.6268
hfenergy: -851.8982871 hartree
pointgroup: C01 [X(C18H28O2)]
dipole: -0.4539428 -0.3513466 -0.5230905 debye
polarizability: 252.9175638|-1.6791879|202.1412324|4.9183734|0.3357805|146.8367842 unknown
InChI: InChI=1S/C18H28O2/c1-3-4-5-6-7-8-9-10-11-12-13-14-15-16-17-20-18(2)19/h3-5,8-9,12-17H2,1-2H3
charge 0 multiplicity 1
48 atoms
O  3.564658 0.918945 -0.086269
O  5.204975 1.981703 1.184033
C  -1.265664 2.181316 -0.408683
C  0.095577 2.513476 0.24201
C  -2.405893 3.09477 0.089588
C  1.229332 1.584731 -0.252574
C  -3.792651 2.73072 -0.51684
C  2.559959 1.900352 0.429211
C  0.84982 -2.733153 -0.270906
C  -4.240435 1.369083 -0.163345
C  2.332712 -2.772447 0.160303
C  -0.094615 -2.341653 0.901337
C  3.271312 -3.198467 -0.989252
C  -4.976212 -1.150436 0.506476
C  -4.579291 0.223347 0.150351
C  -4.127726 -2.253195 -0.209921
C  4.876496 1.085326 0.373506
C  -1.518918 -2.297497 0.520861
C  -2.707638 -2.268102 0.185492
C  5.802272 0.070403 -0.262626
H  -1.529721 1.126044 -0.196887
H  -1.178654 2.268988 -1.512003
H  0.360827 3.570877 0.031855
H  0.000387 2.428381 1.344747
H  -2.180113 4.150615 -0.164131
H  -2.471628 3.034513 1.193747
H  0.958338 0.529878 -0.053481
H  1.347328 1.683185 -1.34881
H  -4.54714 3.466709 -0.174093
H  -3.742268 2.825542 -1.620912
H  2.502581 1.795469 1.528812
H  2.918526 2.921399 0.201616
H  0.544618 -3.722977 -0.66333
H  0.719078 -2.009836 -1.0996
H  2.633817 -1.770501 0.527944
H  2.446858 -3.472961 1.013064
H  0.04564 -3.06183 1.733311
H  0.21309 -1.351705 1.297735
H  3.213918 -2.482022 -1.830293
H  4.324556 -3.248305 -0.654601
H  2.996062 -4.19692 -1.378201
H  -6.040841 -1.309806 0.242285
H  -4.893173 -1.292338 1.601217
H  -4.208369 -2.106465 -1.304267
H  -4.583815 -3.238034 0.015816
H  5.255068 -0.83882 -0.553899
H  6.617891 -0.17395 0.435369
H  6.25277 0.50845 -1.17236
