program: Gaussian 09
title: 000112804
version: EM64L-G09RevD.01
frameworkgroup: C1[X(C6H10Cl4)]
method: RPBEPBE
basis: SDD
operation: Freq
keyword: #pfreq=noraman
keyword: PBEPBE/SDD
title: #p freq=noraman PBEPBE/SDD
converged: YES YES NO NO
title: Mulliken charges:
elementType: Cl Cl Cl Cl C C C C C C H H H H H H H H H H
charge: -0.074619 0.097357 0.121341 0.072608 -0.041591 -0.314341 -0.244347 -0.688976 -0.688119 -0.635956 0.212772 0.290202 0.295276 0.260790 0.221796 0.234715 0.218388 0.215245 0.214354 0.233105
chargesum: 0.00000
title: Mulliken charges with hydrogens summed into heavy atoms:
elementType: Cl Cl Cl Cl C C C C C C
charge: -0.074619 0.097357 0.121341 0.072608 0.171180 -0.024138 0.311720 -0.014077 -0.025415 -0.635956
polarizability: 1.07197921e+02 2.54807461e+00 1.05585898e+02 -6.88715625e+00 1.07585459e+00 9.24963179e+01
1716.lowfreq: -18.3984 -5.5952 -3.7687 0.0017 0.0030 0.0033 17.0647 59.4703 86.2528
frequency: 14.9461 59.4635 86.2513 117.0920 169.1536 177.1664 193.9279 212.5052 219.5834 235.1929 264.3133 278.6553 337.5404 360.7938 403.2003 454.7888 484.4394 538.0454 626.0636 640.8435 723.9252 818.1191 918.0878 945.7728 956.4139 975.8479 1037.7665 1073.6128 1092.4688 1134.9250 1185.0359 1195.5635 1248.0397 1267.5173 1318.3991 1320.4971 1355.7122 1381.5711 1400.3910 1425.0610 1464.9056 1471.6401 1479.4834 1490.7839 2940.2217 2982.4126 2985.2251 3012.6861 3068.9156 3074.8241 3079.2063 3082.5792 3088.1257 3093.1362
redmass: 7.1843 5.3029 3.7650 6.0205 5.6641 6.5827 1.2918 2.3305 2.8163 1.7672 15.7166 7.1316 7.4178 2.4799 2.3983 4.5172 3.2443 5.1413 5.4804 4.2062 4.9256 3.3055 1.1981 1.8304 1.4797 2.1506 4.8778 1.4269 3.2556 2.3394 1.2562 1.5930 1.3147 1.1468 1.4415 1.4803 1.4017 1.2097 1.2041 1.0753 1.0448 1.0502 1.0456 1.0569 1.0818 1.0357 1.0366 1.0618 1.0885 1.0991 1.0986 1.0985 1.1002 1.0995
irintensity: 0.5299 0.9669 0.0787 0.8060 0.1078 0.2837 0.1669 1.8044 1.7093 0.6225 0.2342 1.9812 0.9335 2.5630 4.2562 13.5869 5.1392 40.4851 98.9020 75.8380 65.5781 18.4161 3.0658 22.6822 16.0814 51.8971 19.9243 0.3785 50.0485 7.0208 23.3937 2.0214 17.6069 2.2331 7.2312 6.4177 2.7556 29.1668 19.7426 9.9190 3.2797 3.3076 17.6337 14.9942 20.0249 37.1129 11.8433 3.6196 1.5362 23.5897 56.3664 0.5849 1.6718 37.7989
temp: 298.150 k
press: 1.00000 atm
elementType: 17 17 17 17 6 6 6 6 6 6 1 1 1 1 1 1 1 1 1 1
symmnumber: 1
zpe: 388564.1 jmol-1
zpe.correction: 0.147996 hartree
zpe.thermalcorrener: 0.160898 hartree
zpe.thermalcorrenthalpy: 0.161842 hartree
zpe.thermalcorrgfe: 0.106579 hartree
zpe.sumelectzpe: -2074.062112 hartree
zpe.sumelectthermal: -2074.049210 hartree
zpe.sumelectthermalent: -2074.048266 hartree
zpe.sumelectthermalfe: -2074.103529 hartree
dipole: 1.8844 -2.2778 0.5489
dipole: 3.0068
quadrupole: -91.6373 -90.7663 -87.7274
quadrupole: -4.7756 -0.8460 -0.4961
quadrupole: -1.5936 -0.7227 2.3163 -4.7756 -0.8460 -0.4961
hfenergy: -2074.210108 hartree
pointgroup: C01 [X(C6H10Cl4)]
dipole: 0.8631576 -0.7652933 -0.2620518 debye
dipolederiv: -0.3011388 -0.0508895 -0.0305473 -0.046203 -0.3948065 -0.1769954 -0.0345443 -0.2331057 -0.3659737 -0.5429212 -0.3219943 0.1172331 -0.3151603 -0.4732092 0.1402458 0.122362 0.1346537 -0.2120827 -0.2102148 0.1596124 0.061333 0.1403916 -0.6291529 -0.1813906 0.0343859 -0.1612089 -0.1966899 -0.2352594 -0.0068015 0.0378112 0.0089159 -0.1705221 -0.013398 0.0537532 -0.0176938 -0.7841274 0.1170589 -0.0358909 -0.0457862 -0.0377635 0.0156406 -0.0677533 0.0262294 -0.0918038 0.051261 0.2504514 0.0241765 0.0241922 0.1439911 0.4818595 0.3467476 0.0008232 0.3507218 0.4249832 -0.2265521 -0.0281044 0.0525094 -0.0166717 -0.1920705 -0.0130338 0.013399 -0.0192953 -0.2244226 -0.0050432 0.0183844 -0.0102425 0.0521572 0.0071354 0.086321 -0.0130785 0.060419 -0.0295305 -0.0715891 -0.0531158 0.0137917 -0.0035311 0.0040765 0.0245759 0.0378052 0.0467685 0.048781 1.0552555 0.1752615 -0.1620971 0.0918762 1.2969264 0.0482662 -0.1650931 0.0677337 1.2603644 -0.0013126 -0.0148305 -0.0300477 -0.0510696 -0.0374964 -0.0962867 -0.0778173 -0.0720392 -0.0683686 0.0771346 0.0389622 -0.026779 0.0292733 -0.0367083 0.0016284 -0.0298862 0.0110106 -0.0532206 0.0548042 -0.0100622 -0.0385372 0.006729 0.106873 0.0181025 0.0268834 0.019081 -0.0044078 0.0397465 0.0399646 0.0010274 0.0151469 -0.0408924 -0.0586635 -0.0168277 -0.0543634 0.0803899 -0.0393373 -0.1458304 0.0636597 -0.1296477 -0.0112985 0.0634122 0.057947 0.0536973 0.0388793 0.0900513 -0.0185543 -0.033412 -0.0655771 0.0237549 -0.1182756 -0.0543554 -0.0432068 -0.0238031 -0.0969885 0.1349962 0.032859 0.1132473 0.0223352 -0.0159604 0.0639624 -0.0444264 0.0680341 -0.1078904 0.0814279 0.0708281 0.1211577 0.0073387 -0.0497965 0.0693161 -0.0219107 0.0799135 0.0620535 0.0410287 -0.0840461 0.0112867 -0.0065051 0.1193021 -0.0389508 0.1228371 -0.0648276 0.0916915 -0.0277407 -0.0137498 -0.0685487 0.0267216 -0.057048 -0.0763133 -0.1078689 -0.0251518 unknown
polarizability: 107.0063096|5.9302616|100.9184863|-3.3310445|7.0721201|97.3553408 unknown
InChI: InChI=1S/C6H10Cl4/c1-4(2)5(7)3-6(8,9)10/h4-5H,3H2,1-2H3
charge 0 multiplicity 1
20 atoms
Cl 1.076632 1.536416 1.383371
Cl -3.061475 -1.436524 0.24901
Cl -2.305425 1.491998 0.275332
Cl -1.688284 -0.205174 -2.157357
C  2.080168 -0.477914 -0.350259
C  0.780626 0.305643 -0.057666
C  -0.414934 -0.606002 0.30471
C  2.542043 -1.358547 0.834097
C  3.215104 0.451845 -0.8338
C  -1.765259 -0.190989 -0.279794
H  1.805653 -1.147386 -1.197039
H  0.541123 0.973733 -0.901551
H  -0.523331 -0.679623 1.4007
H  -0.219338 -1.627146 -0.074155
H  1.758638 -2.063275 1.167898
H  2.823936 -0.727226 1.695226
H  3.424391 -1.954579 0.540377
H  4.091265 -0.144474 -1.146185
H  2.896571 1.068138 -1.695059
H  3.531995 1.132984 -0.024657
