program: Gaussian 09
title: 000112714
version: EM64L-G09RevD.01
frameworkgroup: C1[X(C9H19N3OS)]
method: RPBEPBE
basis: SDD
operation: Freq
keyword: #p
keyword: freq=noraman
keyword: PBEPBE/SDD
title: #p freq=noraman PBEPBE/SDD
converged: YES YES NO NO
title: Mulliken charges:
elementType: S O N N N C C C C C C C C C H H H H H H H H H H H H H H H H H H H
charge: 0.295221 -0.251747 -0.291746 -0.112616 -0.576968 -0.366819 -0.362388 -0.342019 -0.341860 -0.711618 -0.688690 -0.071235 0.153017 -0.750146 0.212592 0.176742 0.211271 0.179383 0.194763 0.193153 0.241449 0.210187 0.229431 0.269988 0.247146 0.217575 0.208487 0.211342 0.363159 0.340460 0.237346 0.237818 0.237323
chargesum: 0.00000
title: Mulliken charges with hydrogens summed into heavy atoms:
elementType: S O N N N C C C C C C C C C
charge: 0.295221 -0.251747 -0.050297 -0.112616 0.126651 0.022516 0.028266 0.045897 0.097757 -0.194483 -0.051286 -0.071235 0.153017 -0.037660
polarizability: 2.37712064e+02 -6.08251422e+00 1.35812326e+02 -2.87115705e+00 -8.05761848e-02 9.22279618e+01
1716.lowfreq: -19.3382 -0.0024 -0.0022 -0.0004 3.9741 4.8746 13.6943 22.4795 37.4891
frequency: -7.4103 19.9721 37.3349 44.9241 78.5238 89.6118 95.5258 99.1006 120.2799 135.8746 139.4492 155.3971 187.8236 189.6268 227.0997 244.6352 316.4957 334.2328 380.5360 433.8957 445.1155 448.6873 473.4440 520.4678 559.3110 590.4958 643.4440 650.7242 674.0719 696.9991 737.8099 799.9341 810.7375 853.6110 894.1345 933.3773 967.7274 980.3240 1018.1237 1030.6549 1035.3682 1057.1434 1082.8426 1097.5891 1112.8554 1124.8423 1140.0115 1194.7515 1216.4135 1234.4748 1256.9991 1270.6860 1276.7244 1285.7497 1293.2289 1320.9656 1332.6659 1353.2753 1375.7158 1384.4291 1390.5014 1444.1162 1448.3498 1452.6558 1456.1365 1467.6675 1473.5563 1476.5690 1482.9503 1487.6513 1496.6155 1531.2424 1554.4295 1613.3983 2860.5272 2889.0665 2957.1385 2970.2852 2973.6041 2993.3770 2996.2398 2998.5498 3010.1206 3030.3757 3040.9412 3070.5381 3073.9672 3082.1231 3082.2970 3133.0866 3422.5641 3533.8390 3690.4709
redmass: 2.9972 3.7300 4.1497 2.3549 3.3414 2.1841 1.1618 3.4188 3.0014 1.9985 5.2324 3.1546 4.3715 4.5625 1.1378 3.9215 3.7871 3.4352 5.2276 4.2173 1.3181 2.9291 3.0860 1.5503 4.9039 2.2366 5.4379 3.3825 2.2163 2.0266 1.0728 1.1304 1.1455 3.9468 1.8444 1.1778 1.6191 1.8415 2.7454 2.3209 1.7238 3.4076 2.3176 2.0693 1.3675 1.9900 3.9708 1.5996 1.2657 1.3423 2.8157 1.3277 1.1580 1.0807 1.1306 3.5730 1.4093 1.5359 1.3212 1.3334 1.2982 1.1309 1.1486 1.0491 1.1391 1.0696 1.0646 1.0427 1.0769 1.0842 1.0869 4.2948 4.8773 1.4489 1.0709 1.0705 1.0635 1.0599 1.0367 1.0558 1.0366 1.0850 1.0985 1.0886 1.1017 1.1009 1.0993 1.0970 1.1085 1.1008 1.0740 1.0451 1.1038
irintensity: 0.1314 1.3405 2.9159 0.4835 2.3376 0.8240 0.0920 1.0220 1.3654 4.3344 2.4589 4.7928 4.1566 3.4347 0.1066 8.9997 1.0623 0.6743 14.4722 0.3557 57.5776 11.2757 3.9490 131.0224 59.3085 10.1496 27.9046 67.0678 34.0273 56.2854 12.2202 2.5591 3.3911 50.2194 6.2199 3.7670 6.9366 51.1219 0.6674 5.7987 8.9224 1.1702 0.6443 12.0568 43.6481 4.1342 97.3568 3.6148 5.7387 9.2358 119.3606 16.2941 6.4193 2.1200 1.0370 271.5811 60.0547 18.5208 132.2308 1.4393 8.1811 53.0821 44.8676 16.4925 3.1373 1.7368 1.1300 12.8002 14.0054 3.6820 8.5200 378.3816 251.8937 312.6719 97.2351 77.5538 11.1389 58.2243 35.2472 18.7123 5.3160 34.2907 0.4752 15.1797 47.4306 90.7902 52.9802 8.4459 31.8698 18.0959 1.4112 59.0302 50.1462
temp: 298.150 k
press: 1.00000 atm
elementType: 16 8 7 7 7 6 6 6 6 6 6 6 6 6 1 1 1 1 1 1 1 1 1 1 1 1 1 1 1 1 1 1 1
symmnumber: 1
zpe: 730267.6 jmol-1
zpe.correction: 0.278144 hartree
zpe.thermalcorrener: 0.295634 hartree
zpe.thermalcorrenthalpy: 0.296579 hartree
zpe.thermalcorrgfe: 0.230634 hartree
zpe.sumelectzpe: -990.748610 hartree
zpe.sumelectthermal: -990.731120 hartree
zpe.sumelectthermalent: -990.730176 hartree
zpe.sumelectthermalfe: -990.796121 hartree
dipole: -3.6771 3.9622 0.6813
dipole: 5.4484
quadrupole: -94.6758 -91.9235 -93.5286
quadrupole: 13.0053 -2.5152 1.0961
quadrupole: -1.2998 1.4524 -0.1526 13.0053 -2.5152 1.0961
hfenergy: -991.0267547 hartree
pointgroup: C01 [X(C9H19N3O1S1)]
dipole: -1.3243295 1.5623433 -0.6324778 debye
polarizability: 234.825552|-19.20875|123.4563723|-6.6474361|-19.8464951|107.4704277 unknown
InChI: InChI=1S/C9H19N3OS/c1-3-4-5-11-6-7-14-9(10)12-8(2)13/h11H,3-7,10H2,1-2H3
charge 0 multiplicity 1
33 atoms
S  1.435321 -0.674258 0.156766
O  3.84626 -1.919193 0.655198
N  -2.569774 0.395252 0.086428
N  4.025399 -0.065286 -0.811877
N  2.326758 1.304427 -1.570524
C  -5.057427 0.545182 0.026167
C  -3.834092 -0.31868 0.387972
C  -6.399296 -0.168965 0.307424
C  -1.335107 -0.358886 0.391474
C  -0.138858 0.318856 -0.301798
C  -7.624201 0.699048 -0.052415
C  2.735489 0.237207 -0.808847
C  4.548294 -1.140927 -0.067908
C  6.051784 -1.292969 -0.211576
H  -4.992143 0.822281 -1.044055
H  -5.024224 1.494574 0.602976
H  -3.849615 -1.248414 -0.214972
H  -3.908433 -0.630461 1.460665
H  -6.434801 -1.116301 -0.267988
H  -6.447866 -0.452693 1.378563
H  -2.560346 1.328591 0.523251
H  -1.129495 -0.462166 1.484638
H  -1.453599 -1.383153 -0.009171
H  -0.301457 0.29883 -1.393321
H  -0.023757 1.359055 0.05668
H  -8.570808 0.166668 0.153263
H  -7.630848 1.638233 0.532514
H  -7.615581 0.97203 -1.124421
H  1.356369 1.59536 -1.64238
H  3.050155 1.795405 -2.095273
H  6.407476 -2.14219 0.390529
H  6.313849 -1.44884 -1.273549
H  6.556676 -0.364615 0.110666
