program: Gaussian 09
title: 000112697
version: EM64L-G09RevD.01
frameworkgroup: C1[X(C12H22O2)]
method: RPBEPBE
basis: SDD
operation: Freq
keyword: #pfreq=noraman
keyword: PBEPBE/SDD
title: #p freq=noraman PBEPBE/SDD
converged: YES YES NO NO
title: Mulliken charges:
elementType: O O C C C C C C C C C C C C H H H H H H H H H H H H H H H H H H H H H H
charge: -0.283568 -0.253603 -0.051863 -0.472904 -0.447482 -0.043571 -0.406168 -0.407843 -0.383307 -0.419813 -0.363322 -0.697032 0.285641 -0.759556 0.233591 0.200784 0.211017 0.223357 0.187698 0.250347 0.198479 0.192571 0.192404 0.198903 0.200200 0.188956 0.208698 0.225839 0.218283 0.202129 0.216734 0.208328 0.212303 0.244812 0.244498 0.244461
chargesum: 0.00000
title: Mulliken charges with hydrogens summed into heavy atoms:
elementType: O O C C C C C C C C C C C C
charge: -0.283568 -0.253603 0.181728 -0.061102 -0.036427 0.206777 -0.015117 -0.016537 0.005848 0.014724 0.057089 -0.059667 0.285641 -0.025785
polarizability: 1.48731063e+02 4.76812038e+00 1.34929599e+02 -4.81067634e-01 2.49924231e+00 1.15120549e+02
1716.lowfreq: -31.4063 -7.2566 -0.0008 -0.0008 -0.0007 10.9802 21.7627 39.3855 50.3770
frequency: -31.2091 39.2784 50.1632 66.1608 74.8878 81.3519 97.5686 161.8163 195.8511 215.8884 220.3066 235.6234 264.1663 299.8151 313.0085 335.4073 407.3815 428.4926 449.0111 467.9327 528.3086 563.4021 616.9671 636.8371 734.5437 783.9234 784.9463 801.1780 838.8815 856.7062 876.3673 894.0922 898.6972 907.7210 921.6649 954.3449 994.5242 1010.2214 1039.7835 1050.9099 1053.5105 1057.1821 1070.7630 1089.5146 1102.8582 1114.9654 1138.1260 1169.1007 1185.7764 1207.8862 1225.2933 1240.5793 1257.3431 1261.1942 1275.4915 1289.0393 1293.4447 1306.4136 1321.6516 1334.3395 1335.6852 1339.3163 1341.8547 1349.6547 1366.3501 1372.1032 1381.7763 1392.3040 1452.4810 1455.6369 1459.4685 1461.8805 1462.7538 1467.0985 1471.1675 1475.6101 1477.7744 1479.2061 1488.3040 1642.3922 2954.4130 2956.4134 2964.9321 2965.2578 2965.8888 2971.4228 2973.9443 2979.0201 2984.0799 3005.9874 3006.3924 3020.5510 3024.1626 3026.8645 3028.9121 3038.0353 3043.5139 3047.6459 3069.9414 3072.5108 3094.1924 3140.9307
redmass: 1.0833 7.0604 2.8067 3.1236 2.4046 2.9397 1.9863 2.9953 2.7133 5.0529 1.8093 1.2697 3.3122 2.9369 1.9551 2.8960 2.0302 2.9545 2.8796 2.8513 1.9371 3.0676 3.3926 4.2671 1.2328 2.4569 1.4664 2.2850 2.4263 1.8324 1.6936 1.6889 1.7470 3.4367 1.9033 2.0768 1.8091 2.1130 1.6675 2.4174 1.8575 1.2944 1.3755 1.9061 1.6406 2.4401 2.1750 2.4035 1.5261 3.0969 1.4557 1.2889 1.2885 1.2663 1.2967 1.3467 1.1243 1.2902 1.2667 1.4038 1.3918 1.4487 1.4893 1.4669 1.5572 1.4950 1.2552 1.2196 1.0654 1.0474 1.0883 1.0883 1.0891 1.0717 1.0813 1.0614 1.0425 1.0862 1.0851 9.1080 1.0660 1.0657 1.0602 1.0640 1.0644 1.0380 1.0726 1.0648 1.0623 1.0566 1.0625 1.0970 1.0965 1.0950 1.1012 1.1011 1.1013 1.0983 1.1005 1.0999 1.0974 1.1009
irintensity: 1.3474 1.0047 0.0522 0.4117 0.5147 1.6793 0.3927 1.6791 2.5118 5.9242 0.0977 0.6894 0.6772 0.4666 1.1678 1.4744 0.4718 0.0020 4.5309 2.4322 4.7000 2.5258 2.3906 3.8216 8.5980 4.4835 0.0459 5.7651 7.3212 0.7407 4.6759 19.3473 1.2262 52.4999 1.1889 43.6126 74.6220 6.4563 8.0993 1.2332 0.5764 1.9248 4.4456 4.5463 34.6153 1.2839 8.6336 16.4620 19.8389 317.2305 15.1046 0.6918 5.4025 1.5498 5.8874 3.7024 0.3347 1.7397 0.6308 0.0856 0.3786 3.6511 0.8486 2.8233 0.6444 1.1968 58.1485 10.3428 25.5917 18.0781 4.3908 7.3969 9.9044 4.6505 21.3964 1.3329 12.5838 5.1655 14.4453 183.9700 18.1546 25.0201 35.5790 28.3561 28.5865 37.0603 22.1903 6.1770 41.7564 5.6295 25.2040 8.8193 88.9023 76.6217 5.6809 66.2175 19.0518 77.7302 74.0660 57.6707 9.2328 12.1472
temp: 298.150 k
press: 1.00000 atm
elementType: 8 8 6 6 6 6 6 6 6 6 6 6 6 6 1 1 1 1 1 1 1 1 1 1 1 1 1 1 1 1 1 1 1 1 1 1
symmnumber: 1
zpe: 837986.7 jmol-1
zpe.correction: 0.319172 hartree
zpe.thermalcorrener: 0.334418 hartree
zpe.thermalcorrenthalpy: 0.335362 hartree
zpe.thermalcorrgfe: 0.276009 hartree
zpe.sumelectzpe: -619.800678 hartree
zpe.sumelectthermal: -619.785432 hartree
zpe.sumelectthermalent: -619.784488 hartree
zpe.sumelectthermalfe: -619.843841 hartree
dipole: 1.1759 0.6428 -1.7513
dipole: 2.2053
quadrupole: -87.5531 -85.4019 -90.8408
quadrupole: -0.1133 7.5458 4.5397
quadrupole: 0.3789 2.5300 -2.9089 -0.1133 7.5458 4.5397
hfenergy: -620.1198498 hartree
pointgroup: C01 [X(C12H22O2)]
dipole: -0.4754673 -0.2233882 -0.6904959 debye
polarizability: 148.8602269|4.5474492|134.9585102|0.133884|-1.8921305|114.9624736 unknown
InChI: InChI=1S/C12H22O2/c1-3-7-12(14-10(2)13)11-8-5-4-6-9-11/h11-12H,3-9H2,1-2H3
charge 0 multiplicity 1
36 atoms
O  1.307388 0.830864 -0.403658
O  2.614074 1.460292 1.428725
C  -0.958405 -0.021811 -0.117441
C  -1.911838 -0.974828 0.654591
C  -1.521992 1.42351 -0.10879
C  0.463916 -0.060458 0.481695
C  -3.358734 -0.906525 0.108523
C  -2.96627 1.48891 -0.657317
C  -3.90637 0.539225 0.120872
C  1.150348 -1.439132 0.561117
C  1.24671 -2.207039 -0.776669
C  2.074532 -3.503339 -0.642776
C  2.352535 1.528277 0.204918
C  3.096603 2.360131 -0.820214
H  -0.902947 -0.36459 -1.17214
H  -1.913808 -0.693937 1.729513
H  -1.546039 -2.01793 0.596852
H  -0.856979 2.081041 -0.698207
H  -1.51151 1.804923 0.935132
H  0.464404 0.399575 1.490567
H  -4.014692 -1.571924 0.703019
H  -3.372255 -1.290919 -0.93273
H  -2.964946 1.20287 -1.729867
H  -3.341463 2.529535 -0.605666
H  -4.92646 0.566601 -0.308919
H  -3.989049 0.88876 1.171153
H  0.609248 -2.055202 1.307097
H  2.166304 -1.285899 0.974371
H  1.701926 -1.547666 -1.540704
H  0.231603 -2.4587 -1.142761
H  2.129771 -4.047831 -1.60333
H  1.630031 -4.185562 0.106849
H  3.109049 -3.281535 -0.319634
H  2.402109 3.053526 -1.325305
H  3.529793 1.706275 -1.597168
H  3.897313 2.928813 -0.325899
