program: Gaussian 09
title: 000112677
version: EM64L-G09RevD.01
frameworkgroup: C1[X(C15H13N3O)]
method: RPBEPBE
basis: SDD
operation: Freq
keyword: #p
keyword: freq=noraman
keyword: PBEPBE/SDD
title: #p freq=noraman PBEPBE/SDD
converged: NO YES NO NO
title: Mulliken charges:
elementType: O N N N C C C C C C C C C C C C C C C H H H H H H H H H H H H H
charge: -0.240887 -0.279562 -0.007593 -0.017602 0.373631 0.466519 -0.505641 -0.369261 -0.389260 -0.192021 -0.803241 0.231300 -0.135250 -0.779361 -0.193147 -0.264949 0.277307 -0.243385 -0.250462 0.266853 0.263041 0.241788 0.237722 0.228399 0.250979 0.229115 0.287400 0.266566 0.258995 0.258120 0.277638 0.256250
chargesum: 0.00000
title: Mulliken charges with hydrogens summed into heavy atoms:
elementType: O N N N C C C C C C C C C C C C C C C
charge: -0.240887 -0.279562 -0.007593 -0.017602 0.373631 0.466519 -0.238788 -0.106220 -0.147472 0.045701 -0.094749 0.231300 0.152150 0.004319 0.084491 -0.008699 0.277307 -0.243385 -0.250462
polarizability: 2.98690195e+02 -2.42955701e+01 2.17038658e+02 -3.30867288e+00 -5.60794842e+00 1.27687357e+02
1716.lowfreq: -9.0940 -3.4308 0.0001 0.0005 0.0005 3.4613 16.6127 28.4188 32.0225
frequency: 16.0975 28.3547 31.9245 36.9917 57.4049 74.9458 82.3255 111.8806 115.1314 128.9868 140.9317 208.3171 223.7736 236.8218 248.8174 280.3049 301.0185 309.8679 369.6671 378.8542 435.6835 445.3150 458.6649 488.7645 491.5590 514.0207 558.0734 590.7476 593.4755 612.1192 624.4977 643.3109 693.8515 712.9919 789.5963 799.9908 861.8592 892.0835 901.0372 921.6367 924.1318 961.7558 986.5238 988.9720 991.6802 1000.0465 1009.6937 1033.1020 1049.8509 1093.8932 1120.1189 1150.8359 1180.4800 1205.5124 1223.3188 1254.0272 1277.0529 1298.0418 1299.7019 1333.0482 1356.5867 1376.0065 1387.6134 1401.5040 1426.8401 1446.7713 1457.8051 1471.1083 1473.3071 1482.5553 1562.5521 1593.7397 1611.8934 1614.2804 1639.2630 2159.6619 2171.4125 2981.8306 3002.0609 3064.4651 3085.9310 3091.5241 3121.3226 3131.8453 3134.3103 3134.7718 3136.5562 3142.6807 3145.8231 3165.8508
redmass: 3.1323 3.9213 1.3616 5.3901 4.2263 4.5595 5.9521 1.5305 7.4986 2.7417 6.0695 3.0918 6.8668 5.6455 2.1619 5.2466 4.9882 3.4448 3.8413 4.2544 4.0730 4.3251 6.5024 4.4843 4.4421 5.1198 5.2170 12.3011 3.5921 3.9210 5.6320 6.8434 3.8638 2.6147 4.5422 1.6352 4.0332 1.5433 1.4337 1.4166 1.4221 2.7584 2.0747 1.6740 2.2901 1.1470 1.8073 1.6684 1.5718 1.6219 2.3288 2.5755 1.1009 2.8674 2.8639 2.2984 2.0635 1.6585 1.3403 3.0946 1.8391 8.1281 1.2279 1.2168 2.5706 1.0754 1.0558 1.4567 1.0948 1.6798 6.6118 5.9905 6.2270 6.7852 6.2230 12.6184 12.6331 1.0386 1.0376 1.0955 1.0968 1.1000 1.0928 1.0882 1.0940 1.0932 1.1001 1.0859 1.0920 1.0997
irintensity: 0.1849 0.6295 1.3852 1.9571 0.3848 7.4161 0.9315 0.8824 1.4539 2.4314 2.4878 3.2014 1.4997 2.9727 2.8425 1.0905 1.3082 1.0509 1.5729 1.0422 7.5109 0.4000 0.1259 6.1959 2.6668 0.9753 4.0521 0.8467 3.8970 24.0795 2.6735 0.3098 16.5044 29.3027 1.4059 5.5586 12.6735 6.2390 1.0797 0.2057 5.3694 0.3277 50.6142 2.2355 21.6075 63.5647 57.0126 3.6742 14.7088 11.1555 35.5779 3.3571 0.4457 505.9544 76.6103 187.5447 113.6541 145.8408 10.0561 283.9651 0.4321 2.6236 62.2370 16.8232 13.6225 35.3362 21.8647 14.6290 16.2094 55.4089 5.3250 47.9944 141.6599 531.4099 223.1968 20.2421 90.9377 19.6182 1.8140 16.3645 5.4381 15.0860 1.9742 4.0587 4.3056 3.2191 12.2465 22.4857 11.9722 10.1963
temp: 298.150 k
press: 1.00000 atm
elementType: 8 7 7 7 6 6 6 6 6 6 6 6 6 6 6 6 6 6 6 1 1 1 1 1 1 1 1 1 1 1 1 1
symmnumber: 1
zpe: 632617.3 jmol-1
zpe.correction: 0.240951 hartree
zpe.thermalcorrener: 0.260083 hartree
zpe.thermalcorrenthalpy: 0.261027 hartree
zpe.thermalcorrgfe: 0.189974 hartree
zpe.sumelectzpe: -817.505737 hartree
zpe.sumelectthermal: -817.486605 hartree
zpe.sumelectthermalent: -817.485661 hartree
zpe.sumelectthermalfe: -817.556714 hartree
dipole: -9.5606 -0.4451 0.0798
dipole: 9.5713
quadrupole: -141.4473 -123.7144 -103.8527
quadrupole: 12.2605 -0.4175 4.1423
quadrupole: -18.4425 -0.7096 19.1521 12.2605 -0.4175 4.1423
hfenergy: -817.7466882 hartree
pointgroup: C01 [X(C15H13N3O1)]
dipole: -3.7523752 0.3125032 -0.0441732 debye
polarizability: 300.2842932|21.1454066|215.6995119|5.1004366|-2.0947201|127.4324046 unknown
InChI: InChI=1S/C15H13N3O/c1-12-5-3-7-15(9-12)18(13(2)19)8-4-6-14(10-16)11-17/h3-9H,1-2H3
charge 0 multiplicity 1
32 atoms
O  -1.556838 -3.720037 0.216105
N  -1.189122 -1.422085 -0.040293
N  6.085621 -0.737594 0.284072
N  3.065037 2.578357 -0.245431
C  -1.727516 -0.081167 -0.233252
C  -2.51083 2.039041 0.730298
C  -2.00123 0.725789 0.893123
C  -1.94333 0.400021 -1.543393
C  -2.741037 2.511673 -0.588798
C  -2.457154 1.704763 -1.713473
C  -2.771453 2.926412 1.933756
C  -2.052151 -2.574992 0.051871
C  0.189152 -1.612673 0.059432
C  -3.540716 -2.311368 -0.05622
C  1.140015 -0.613266 -0.007255
C  2.535278 -0.924008 0.106859
C  3.571037 0.010457 0.060445
C  4.941935 -0.397301 0.182367
C  3.308371 1.413857 -0.107259
H  -1.806924 0.3301 1.89715
H  -1.706591 -0.232358 -2.4057
H  -3.136515 3.523722 -0.734148
H  -2.631783 2.092687 -2.722547
H  -3.044996 2.336658 2.82591
H  -1.868031 3.512128 2.191283
H  -3.583641 3.647285 1.736362
H  0.464076 -2.664906 0.200498
H  -4.066602 -3.270836 0.052351
H  -3.801591 -1.858789 -1.029092
H  -3.885535 -1.612136 0.725922
H  0.84303 0.432652 -0.1483
H  2.820038 -1.976388 0.241856
