program: Gaussian 09
title: 000008330
version: EM64L-G09RevD.01
frameworkgroup: C1[X(C6HCl4NO2)]
method: RPBEPBE
basis: SDD
operation: Freq
keyword: #p
keyword: freq=noraman
keyword: PBEPBE/SDD
title: #p freq=noraman PBEPBE/SDD
converged: YES YES NO NO
title: Mulliken charges:
elementType: Cl Cl Cl Cl O O N C C C C C C H
charge: 0.076710 0.076681 0.035037 0.035023 -0.137620 -0.137632 -0.014894 0.721124 -0.290534 -0.290556 -0.070308 -0.070338 -0.227258 0.294565
chargesum: 0.00000
title: Mulliken charges with hydrogens summed into heavy atoms:
elementType: Cl Cl Cl Cl O O N C C C C C C
charge: 0.076710 0.076681 0.035037 0.035023 -0.137620 -0.137632 -0.014894 0.721124 -0.290534 -0.290556 -0.070308 -0.070338 0.067307
polarizability: 1.62750770e+02 -1.04673113e-03 1.37449441e+02 -7.91954112e-02 -4.39576745e-03 5.87754859e+01
1716.lowfreq: -0.0012 -0.0009 0.0020 3.7655 4.9185 5.0946 29.4000 66.3921 69.0885
frequency: 29.3945 66.3915 69.0884 123.3477 141.8672 179.4504 186.5609 195.5394 201.8654 304.0568 309.1929 324.3632 335.3092 380.7252 484.1749 509.9338 582.0604 587.1226 590.0685 687.8351 714.8723 727.4658 819.4305 838.3898 866.5549 1042.5629 1162.2229 1171.8030 1228.6031 1324.1786 1352.6977 1399.4648 1405.2460 1548.0112 1562.2255 3186.3214
redmass: 16.2747 34.1211 20.6971 14.0000 18.5215 29.5918 25.7208 31.7531 8.5009 27.1196 19.0083 12.5363 29.2685 6.5382 9.1835 12.4807 10.3484 12.0895 5.2818 12.3720 9.3404 13.2572 12.2561 11.9343 1.4075 11.0885 1.5270 11.1214 14.5173 10.7625 8.4228 3.6622 14.6077 11.3273 8.9968 1.0933
irintensity: 0.0000 0.0000 0.3582 0.3201 1.6161 0.0891 0.0007 0.0428 0.0303 0.0271 0.3859 0.0003 0.0029 7.3114 0.9742 16.7714 51.9417 0.0005 2.8473 36.9111 0.2028 25.9911 0.3850 0.3170 19.8638 64.9169 43.1384 5.3950 134.2067 12.7108 21.4436 140.3238 167.3441 3.8567 7.4273 3.7785
temp: 298.150 k
press: 1.00000 atm
elementType: 17 17 17 17 8 8 7 6 6 6 6 6 6 1
symmnumber: 1
zpe: 159333.0 jmol-1
zpe.correction: 0.060687 hartree
zpe.thermalcorrener: 0.073176 hartree
zpe.thermalcorrenthalpy: 0.074120 hartree
zpe.thermalcorrgfe: 0.019325 hartree
zpe.sumelectzpe: -2273.629505 hartree
zpe.sumelectthermal: -2273.617016 hartree
zpe.sumelectthermalent: -2273.616072 hartree
zpe.sumelectthermalfe: -2273.670867 hartree
dipole: -0.0006 -3.5674 -0.0001
dipole: 3.5674
quadrupole: -99.9723 -105.6424 -104.2703
quadrupole: -0.0009 0.0356 -0.0009
quadrupole: 3.3227 -2.3474 -0.9753 -0.0009 0.0356 -0.0009
hfenergy: -2273.690192 hartree
pointgroup: C01 [X(C6H1Cl4N1O2)]
dipole: -1.403481 -0.0051981 0.0073867 debye
dipolederiv: -0.1531386 -0.289761 0.031545 -0.215628 -0.4718986 0.0541863 0.0240157 0.0544261 0.026855 -0.157388 0.2925696 -0.0300658 0.2184832 -0.46821 0.0517682 -0.0225252 0.0513338 0.027387 -0.2605495 -0.3150387 0.0344076 -0.309671 -0.5135634 0.0553525 0.0338372 0.0554201 -0.0082574 -0.2658038 0.3174036 -0.0321575 0.3120247 -0.509014 0.0518988 -0.0316515 0.0519697 -0.0075863 -0.5873897 0.0183505 0.1798533 0.0011591 -0.1632487 -0.0549175 0.0217197 -0.0549646 -0.6538754 -0.589375 -0.0220585 -0.1801843 -0.0048841 -0.1634371 -0.0561882 -0.0219864 -0.0548752 -0.6516458 1.1771879 0.0046439 -0.0000218 0.0046608 0.1066852 0.1306471 -0.0000405 0.1285678 1.2578279 -0.061772 0.0001981 0.000379 0.0000739 -0.0923454 0.0122788 0.0003733 0.0127696 0.0329096 0.1114375 0.5365771 -0.0572582 0.4573644 0.5872106 -0.0708385 -0.0505909 -0.0709182 -0.0567873 0.119795 -0.5407353 0.0560788 -0.4614034 0.5799821 -0.0658154 0.0493545 -0.0652022 -0.0578414 0.3843695 0.5614668 -0.0610982 0.604679 0.6916949 -0.0783795 -0.0657373 -0.0782024 -0.0160539 0.3942302 -0.5644059 0.0574548 -0.6076117 0.6832357 -0.0717744 0.062186 -0.072032 -0.0172962 -0.1661529 0.00084 0.0005126 0.0008177 -0.3492938 0.032509 0.000496 0.0324221 -0.0448357 0.0545494 -0.0000504 0.0005549 -0.0000644 0.0822024 0.0092729 0.0005493 0.0092856 0.1691999 unknown
polarizability: 137.4480862|-0.1418126|161.6367465|-0.3614196|-10.7028258|59.890864 unknown
InChI: InChI=1S/C6HCl4NO2/c7-2-1-3(8)5(10)6(4(2)9)11(12)13/h1H
charge 0 multiplicity 1
14 atoms
Cl 0.872177 2.759873 -0.294964
Cl 0.895219 -2.752017 0.283567
Cl -2.383501 -2.746883 0.2995
Cl -2.406535 2.730862 -0.277157
O  2.710726 -0.117462 -1.153412
O  2.722103 0.139131 1.121956
N  2.137584 0.008697 -0.012613
C  0.642452 0.00311 -0.004534
C  -0.047906 1.226804 -0.129558
C  -0.037597 -1.22564 0.127607
C  -1.449744 -1.216793 0.133801
C  -1.460002 1.207611 -0.121049
C  -2.160271 -0.007167 0.009983
H  -3.252704 -0.011226 0.015573
