program: Gaussian 09
title: 000112663
version: EM64L-G09RevD.01
frameworkgroup: C1[X(C19H24NS)]
method: RPBEPBE
basis: SDD
operation: Freq
keyword: #p
keyword: freq=noraman
keyword: PBEPBE/SDD
title: #p freq=noraman PBEPBE/SDD
converged: YES YES NO NO
title: Mulliken charges:
elementType: S N C C C C C C C C C C C C C C C C C C C H H H H H H H H H H H H H H H H H H H H H H H H
charge: 0.277004 -0.195621 0.289345 -0.636639 -0.572763 0.539413 -0.727143 -0.717216 0.445200 -0.529888 -0.353982 -0.815788 -0.029564 0.606764 -0.394802 -0.338190 -0.330115 -0.271311 -0.642075 -0.210533 -0.223367 0.248992 0.234105 0.245222 0.249821 0.230465 0.215262 0.224692 0.228329 0.221303 0.225244 0.239817 0.242115 0.252552 0.242763 0.254612 0.250367 0.246515 0.258816 0.267147 0.238773 0.251413 0.244176 0.257583 0.261189
chargesum: 1.00000
title: Mulliken charges with hydrogens summed into heavy atoms:
elementType: S N C C C C C C C C C C C C C C C C C C C
charge: 0.277004 -0.195621 0.289345 -0.153542 -0.077721 0.539413 -0.056725 -0.042340 0.445200 -0.290071 -0.111867 -0.065860 -0.029564 0.606764 0.102079 -0.338190 -0.071299 -0.004164 0.092287 0.047050 0.037822
polarizability: 4.73499979e+02 -1.83119908e+01 2.38141399e+02 -1.72623983e+01 3.11021403e+00 1.27326419e+02
1716.lowfreq: -11.9187 -10.1117 -4.8955 -0.0016 -0.0010 0.0016 4.0328 29.6813 58.1927
frequency: -5.6349 29.5900 58.0934 63.7557 76.3681 92.8356 112.9670 142.7946 169.2229 178.2966 198.7914 199.4355 203.2762 211.1546 216.6112 236.7609 269.6449 279.8184 313.4686 324.5254 341.6931 392.2393 398.9813 413.8132 430.6736 433.9543 445.0464 470.6221 495.5689 506.2540 526.2020 530.3673 553.7612 585.5552 618.9419 652.2735 667.4949 689.6177 723.8284 764.0221 770.7956 786.1392 810.4679 835.2800 848.9727 858.6723 865.5132 889.7014 891.2513 911.1319 931.1065 939.1331 953.1827 960.2024 988.1244 999.1139 1002.7745 1022.4215 1024.1262 1025.6079 1030.1322 1046.0520 1088.4375 1132.2820 1136.1350 1142.4968 1150.9273 1159.8771 1182.9871 1188.3535 1220.7545 1247.2759 1251.2643 1277.9645 1290.4352 1293.8080 1297.7054 1315.2705 1334.7414 1342.1147 1371.7826 1384.9426 1389.7264 1394.8488 1400.5773 1403.4456 1403.7214 1426.5123 1433.9503 1445.0682 1450.2317 1452.6274 1454.8114 1463.3795 1469.5812 1470.2703 1481.4526 1483.1111 1485.1548 1486.6884 1514.1362 1562.2227 1592.7295 1596.2700 1597.2121 2938.1013 2948.3902 2970.2508 2974.5430 2981.7700 3001.8680 3015.0135 3035.6422 3041.2545 3047.3919 3070.0306 3074.5383 3079.3919 3080.5546 3088.7698 3099.2335 3104.4278 3112.6961 3134.3115 3148.4143 3156.6134 3164.5680 3174.4816 3187.3755
redmass: 3.7928 4.2653 3.1464 3.8668 3.8597 3.3910 2.9058 1.2225 3.3115 4.1618 2.0593 1.1957 2.1514 2.1003 1.6469 1.4406 1.7113 3.9224 2.6708 2.4231 2.5571 2.3385 3.4204 4.3888 2.7575 3.1275 2.7073 3.8694 6.6135 3.5809 4.0672 4.3574 3.6015 2.8379 4.6682 5.1417 5.1394 5.6850 3.3198 1.3889 1.7587 2.6811 1.7477 1.8277 1.5681 1.3679 1.9826 2.1458 2.1026 2.3630 2.6353 1.4562 1.3676 2.0385 1.6185 1.3437 1.3855 2.0759 2.7259 1.6049 3.2133 2.9122 1.9520 1.7552 1.8296 1.5296 1.6465 1.5245 1.3537 1.5114 2.2845 1.9982 2.3450 1.4110 1.6946 1.7548 1.8474 2.4390 1.6635 1.5227 1.7309 1.2135 1.6504 1.6537 1.6188 1.5515 1.9442 1.1079 1.2820 1.3554 1.6304 1.4002 1.8339 1.0471 1.0754 1.0698 1.4732 1.1523 1.0590 1.0617 1.0875 5.9221 6.9922 6.3127 5.3641 1.0659 1.0648 1.0393 1.0362 1.0363 1.0362 1.0915 1.0944 1.0941 1.0615 1.0999 1.0996 1.0991 1.0993 1.1022 1.0991 1.0996 1.1033 1.0859 1.0893 1.0872 1.0905 1.0959 1.1009
irintensity: 0.3653 0.6934 0.0236 0.0360 0.1342 0.6975 0.0655 1.8891 0.2024 0.1892 0.0134 0.0226 0.6276 1.1844 0.7547 0.1185 0.0798 1.8853 0.7706 0.5233 0.2182 0.7309 5.6571 1.6519 1.3716 2.1315 5.1361 1.6811 3.4910 1.0636 0.5536 6.0118 3.3565 3.6032 1.8198 3.4649 0.4360 7.8982 7.2701 91.2449 21.0184 3.8098 9.1397 6.7618 8.9414 1.2674 23.7804 9.8456 14.2009 2.9520 3.1295 2.0924 0.8669 2.0167 10.7936 0.0406 1.6091 10.3625 5.4611 2.6677 6.4211 2.4469 19.3133 11.5498 2.5663 4.7214 11.8888 11.1082 0.9779 26.4948 6.8166 0.7115 2.3671 10.0736 5.9783 21.6573 24.9728 55.3570 70.1923 11.9378 226.3367 20.6975 27.7569 95.7614 10.9913 9.6277 23.2743 43.2361 49.1736 22.7921 8.6144 17.9075 76.2049 4.1468 14.6797 5.8647 8.5533 1.2269 11.6365 14.3285 31.2288 991.2419 25.7454 245.9473 175.1322 9.0805 11.4244 2.6023 29.6354 14.7112 7.5308 19.8037 11.7202 5.3235 15.3089 26.4627 1.5323 37.4696 42.3217 0.8082 12.9594 18.0645 14.8193 3.1700 7.5566 0.6902 1.2698 2.9560 5.7722
temp: 298.150 k
press: 1.00000 atm
elementType: 16 7 6 6 6 6 6 6 6 6 6 6 6 6 6 6 6 6 6 6 6 1 1 1 1 1 1 1 1 1 1 1 1 1 1 1 1 1 1 1 1 1 1 1 1
symmnumber: 1
zpe: 997118.2 jmol-1
zpe.correction: 0.379782 hartree
zpe.thermalcorrener: 0.400038 hartree
zpe.thermalcorrenthalpy: 0.400982 hartree
zpe.thermalcorrgfe: 0.331818 hartree
zpe.sumelectzpe: -1189.475741 hartree
zpe.sumelectthermal: -1189.455485 hartree
zpe.sumelectthermalent: -1189.454541 hartree
zpe.sumelectthermalfe: -1189.523705 hartree
dipole: -1.4438 1.0487 -0.4037
dipole: 1.8296
quadrupole: -52.6553 -99.3828 -134.1152
quadrupole: -7.4889 -3.6864 1.1157
quadrupole: 42.7291 -3.9984 -38.7308 -7.4889 -3.6864 1.1157
hfenergy: -1189.8555228 hartree
pointgroup: C01 [X(C19H24N1S1)]
dipole: -0.5339368 0.4405371 -0.1974729 debye
polarizability: 464.8140428|-45.1342891|243.3361015|-29.5913408|-10.2040448|130.8176529 unknown
InChI: InChI=1S/C19H24NS/c1-5-20-16-8-6-7-9-17(16)21-18(20)11-15-10-14(2)12-19(3,4)13-15/h6-11H,5,12-13H2,1-4H3
charge 1 multiplicity 1
45 atoms
S  -1.266704 -1.348094 0.498773
N  -1.795881 1.228057 0.340838
C  4.355259 0.268635 0.303868
C  3.077738 0.840251 -0.380242
C  4.474036 -1.228492 -0.100907
C  1.810941 0.051914 -0.075715
C  5.595431 1.043802 -0.200794
C  4.255852 0.407264 1.845725
C  3.185075 -2.013381 0.014551
C  1.950628 -1.382558 0.037685
C  0.614402 0.781001 0.017978
C  3.299913 -3.511196 0.10315
C  -0.724294 0.360702 0.258876
C  -3.065668 0.622498 0.542098
C  -1.671041 2.709154 0.190311
C  -2.985457 -0.788569 0.664956
C  -4.320351 1.26974 0.627271
C  -4.121321 -1.585619 0.883009
C  -1.792816 3.164382 -1.276933
C  -5.464534 0.476686 0.84478
C  -5.371252 -0.933895 0.974135
H  3.234886 0.817343 -1.481045
H  2.948533 1.903242 -0.103558
H  5.266087 -1.727187 0.491812
H  4.81364 -1.297559 -1.159219
H  6.52196 0.624632 0.232587
H  5.686072 0.998077 -1.302502
H  5.544428 2.108141 0.093753
H  5.175663 0.028292 2.32695
H  4.14517 1.468791 2.13412
H  3.399362 -0.150622 2.265103
H  1.065097 -2.016709 0.140541
H  0.727806 1.861894 -0.121232
H  3.933499 -3.90398 -0.715745
H  2.323115 -4.020075 0.065397
H  3.808649 -3.803631 1.043603
H  -2.460147 3.162349 0.812161
H  -0.71264 3.024297 0.632833
H  -4.4181 2.353487 0.522067
H  -4.047993 -2.672455 0.979111
H  -0.991229 2.736829 -1.903291
H  -1.717766 4.2644 -1.328018
H  -2.763007 2.868458 -1.711061
H  -6.443496 0.960388 0.912719
H  -6.275748 -1.525284 1.143302
