program: Gaussian 09
title: 000112464
version: EM64L-G09RevD.01
frameworkgroup: C1[X(C9H18O3)]
method: RPBEPBE
basis: SDD
operation: Freq
keyword: #pfreq=noraman
keyword: PBEPBE/SDD
title: #p freq=noraman PBEPBE/SDD
converged: YES YES NO NO
title: Mulliken charges:
elementType: O O O C C C C C C C C C H H H H H H H H H H H H H H H H H H
charge: -0.276420 -0.297572 -0.461423 -0.076974 -0.266236 0.051754 -0.297957 -0.691728 -0.694417 -0.295495 -0.055792 -0.554760 0.228933 0.176293 0.205504 0.183717 0.200108 0.189416 0.211977 0.221188 0.222589 0.195576 0.239802 0.218735 0.355168 0.202464 0.193673 0.231395 0.222272 0.218210
chargesum: 0.00000
title: Mulliken charges with hydrogens summed into heavy atoms:
elementType: O O O C C C C C C C C C
charge: -0.276420 -0.297572 -0.106256 0.151959 0.115561 0.235472 0.091567 -0.035974 -0.040303 0.100642 0.175603 -0.114278
polarizability: 1.55149028e+02 -1.84473148e+00 9.50380239e+01 -9.21917001e+00 -2.60148202e+00 8.70543275e+01
1716.lowfreq: -6.0843 -0.0008 0.0002 0.0005 4.0066 11.2695 24.0850 34.1459 43.8994
frequency: 24.0091 33.9416 43.6466 55.7559 69.1935 91.9348 122.6144 157.8864 172.0013 197.0608 211.3308 244.4555 257.8274 298.6231 357.0274 395.9971 410.5090 430.6666 446.9417 458.9760 519.7204 552.1288 639.4531 786.4116 843.1841 885.8921 902.6976 917.9119 932.1175 935.6513 936.7101 954.9884 974.0360 1007.9330 1018.5114 1047.3333 1064.4962 1077.4681 1099.6402 1122.8463 1147.0828 1150.4491 1177.6778 1194.7652 1214.6139 1216.7946 1243.6732 1279.2706 1287.2709 1316.8829 1331.3037 1335.5832 1354.1686 1372.6710 1381.3973 1390.2123 1414.3830 1434.0092 1454.8820 1455.9725 1461.0927 1467.7885 1471.6621 1475.1852 1486.9345 1666.0089 2910.5756 2920.6696 2927.3605 2930.2096 2975.3399 2978.5138 2982.6066 2985.7691 2991.1505 3002.6084 3073.2540 3081.8102 3091.3358 3091.4504 3101.7351 3117.0789 3201.4222 3526.0571
redmass: 4.1037 3.3914 2.8458 2.7823 3.3174 3.2539 3.0907 3.5009 2.7907 1.0492 3.7860 1.2970 2.2353 2.6396 2.3978 2.6466 2.5465 2.2567 2.3975 1.2910 2.7599 2.4397 1.6912 3.2533 3.1312 2.8451 2.1459 1.2318 1.5926 2.0900 1.4680 1.3544 1.7197 1.3214 4.2228 6.2190 2.2879 1.9859 3.2385 2.0031 1.7837 1.8307 1.8047 1.2675 1.2093 1.1370 1.0924 1.2362 1.2205 1.1790 1.4445 1.2567 1.2925 1.2614 1.3541 1.2378 1.7065 1.2052 1.0802 1.0682 1.0750 1.0535 1.0546 1.0854 1.0513 4.8010 1.0602 1.0581 1.0789 1.0603 1.0901 1.0370 1.0993 1.1019 1.0356 1.0980 1.0990 1.1005 1.0994 1.0603 1.1001 1.0946 1.1144 1.0647
irintensity: 0.9283 1.2099 1.2013 0.5574 1.1068 0.5572 1.3165 11.4476 2.0716 0.1178 0.3289 0.8881 2.0959 9.1971 7.1952 4.0483 24.1744 21.7294 8.7878 116.1488 5.3935 33.4773 8.0931 6.2601 20.7454 5.5042 22.8239 2.7315 1.4197 7.0683 2.1124 97.6278 6.3128 94.0554 160.9949 90.0859 36.2636 4.8143 12.4126 92.5969 10.3320 18.4620 17.7305 2.6504 3.2882 4.2058 28.8154 10.8424 52.7052 11.7730 10.6266 25.4903 7.6602 24.3190 1.8002 26.0603 6.4110 25.3701 6.4514 6.5695 4.6343 0.6991 6.7041 6.4799 15.3563 3.1193 49.9166 22.5907 53.2376 107.5708 8.7844 27.0913 42.5238 8.8762 22.4763 108.7779 40.5254 13.3155 64.4964 10.2492 30.6817 8.6239 25.5567 13.7460
temp: 298.150 k
press: 1.00000 atm
elementType: 8 8 8 6 6 6 6 6 6 6 6 6 1 1 1 1 1 1 1 1 1 1 1 1 1 1 1 1 1 1
symmnumber: 1
zpe: 674515.7 jmol-1
zpe.correction: 0.256909 hartree
zpe.thermalcorrener: 0.272459 hartree
zpe.thermalcorrenthalpy: 0.273403 hartree
zpe.thermalcorrgfe: 0.212018 hartree
zpe.sumelectzpe: -578.361029 hartree
zpe.sumelectthermal: -578.345479 hartree
zpe.sumelectthermalent: -578.344535 hartree
zpe.sumelectthermalfe: -578.405921 hartree
dipole: 1.1430 3.0398 0.6524
dipole: 3.3125
quadrupole: -61.0150 -73.5069 -76.5689
quadrupole: -1.0169 -1.6384 -0.0737
quadrupole: 9.3486 -3.1433 -6.2053 -1.0169 -1.6384 -0.0737
hfenergy: -578.6179382 hartree
pointgroup: C01 [X(C9H18O3)]
dipole: -0.48159 1.1401305 -0.4081927 debye
polarizability: 155.2581698|2.5800431|95.6591286|-8.6040087|1.2736208|86.3240813 unknown
InChI: InChI=1S/C9H18O3/c1-4-5-11-6-9(10)7-12-8(2)3/h4,8-10H,1,5-7H2,2-3H3
charge 0 multiplicity 1
30 atoms
O  2.537566 -0.003269 0.428541
O  -2.219983 -0.053467 -0.001461
O  0.052404 -1.363786 -0.822529
C  0.170317 -0.12318 -0.043759
C  1.488823 0.544729 -0.433903
C  3.903391 0.096855 -0.133017
C  -1.04668 0.772085 -0.325067
C  4.390046 1.559496 -0.198275
C  4.777351 -0.778305 0.772738
C  -3.49661 0.60585 -0.333263
C  -4.60574 -0.394262 -0.137394
C  -5.72664 -0.160029 0.587425
H  0.198701 -0.351872 1.042106
H  1.420171 1.648096 -0.303861
H  1.694673 0.322037 -1.502726
H  3.885205 -0.330699 -1.161962
H  -1.077311 1.070655 -1.397157
H  -1.024662 1.684791 0.309272
H  5.423024 1.603648 -0.590583
H  3.752669 2.173573 -0.860447
H  4.380413 2.009563 0.811067
H  5.819524 -0.800497 0.406118
H  4.385402 -1.809056 0.797138
H  4.773841 -0.382006 1.803952
H  -0.858345 -1.719435 -0.644793
H  -3.64587 1.499238 0.309553
H  -3.460573 0.942924 -1.395384
H  -4.465441 -1.356114 -0.649739
H  -6.521151 -0.909333 0.671749
H  -5.883113 0.787369 1.118265
