program: Gaussian 09
title: 000112457
version: EM64L-G09RevD.01
frameworkgroup: C1[X(C11H22O2)]
method: RPBEPBE
basis: SDD
operation: Freq
keyword: #pfreq=noraman
keyword: PBEPBE/SDD
title: #p freq=noraman PBEPBE/SDD
converged: YES YES NO NO
title: Mulliken charges:
elementType: O O C C C C C C C C C C C H H H H H H H H H H H H H H H H H H H H H H
charge: -0.312552 -0.274975 0.379488 -0.043122 -0.085110 -0.422684 0.414722 -0.786104 -0.785720 -0.718062 -0.726097 -0.716303 -0.721946 0.183496 0.215697 0.204748 0.221794 0.238498 0.234705 0.209462 0.213344 0.231330 0.217796 0.252922 0.205768 0.193956 0.215371 0.216682 0.208263 0.213105 0.230198 0.224124 0.225843 0.216241 0.225119
chargesum: 0.00000
title: Mulliken charges with hydrogens summed into heavy atoms:
elementType: O O C C C C C C C C C C C
charge: -0.312552 -0.274975 0.379488 0.140374 0.130588 0.003858 0.414722 -0.103439 -0.123251 -0.065416 -0.085780 -0.048876 -0.054742
polarizability: 1.36698840e+02 -3.76761200e+00 1.27427662e+02 1.05864235e+00 1.40736790e+00 1.08455000e+02
1716.lowfreq: -16.0365 -7.8360 -0.0007 -0.0006 -0.0005 17.3345 50.2469 94.9118 122.2641
frequency: 49.8254 94.8818 122.2616 155.4988 166.4174 186.7894 202.7468 211.6148 218.8061 232.9979 254.2474 267.3788 272.2705 294.6141 308.4640 333.3075 360.3699 361.8894 397.9545 410.2224 430.1040 468.9834 485.8436 513.6084 540.4532 633.3908 715.7932 761.1535 792.4864 854.4153 893.2252 903.8211 912.4888 921.0561 925.8751 935.5607 945.1282 958.7709 971.2959 975.8321 988.9661 1015.9237 1018.4007 1114.6449 1135.8795 1147.9370 1179.2322 1188.2439 1208.4148 1210.9703 1219.4809 1247.0293 1264.2779 1285.9377 1306.1357 1330.5760 1346.2092 1356.7075 1372.8541 1376.4408 1378.7149 1387.4579 1390.6338 1399.7724 1448.0330 1452.0591 1458.0364 1461.6971 1466.2594 1470.3522 1471.9027 1475.8261 1477.6169 1478.8820 1487.8773 1490.5548 1496.3791 2944.3117 2970.0850 2972.3919 2974.4212 2975.9974 2980.6047 2996.3360 2998.1369 3001.3349 3056.7608 3058.6078 3063.7340 3067.2736 3070.5718 3081.3694 3084.6675 3091.0019 3097.8563 3099.5940 3105.2312 3105.8520 3109.1980
redmass: 2.8090 2.6159 3.1782 2.0027 1.1893 1.4812 1.4858 1.1862 1.1332 1.3127 1.4174 1.3626 2.3756 2.3841 2.5188 2.8779 2.3765 2.5681 2.5220 2.5195 2.9064 3.0608 3.1647 2.6357 3.8192 4.5218 4.3625 3.1473 4.0242 2.3025 2.4140 2.3453 1.8174 1.3582 1.4670 1.6387 1.9097 1.7911 1.7558 1.6192 1.3377 1.8444 2.5327 2.2330 2.0992 2.0323 1.9293 2.1860 2.5297 2.4635 2.9554 3.1135 1.3625 1.4532 1.3725 1.2957 1.4135 1.2881 1.2083 1.2531 1.2336 1.2178 1.2179 1.1984 1.0613 1.0507 1.0640 1.0509 1.0546 1.0590 1.0514 1.0500 1.0505 1.0513 1.0513 1.0557 1.0538 1.0822 1.0386 1.0373 1.0398 1.0402 1.0570 1.0798 1.0372 1.0355 1.0985 1.0986 1.0989 1.0980 1.1008 1.0993 1.0986 1.0966 1.0998 1.0998 1.1000 1.0975 1.1000
irintensity: 0.2368 0.0621 1.1987 0.3365 0.0718 1.7200 1.0423 0.8439 0.1811 1.0011 0.2770 0.0802 0.1665 1.5193 0.2828 1.9950 2.2167 3.7417 4.3674 4.1347 4.1867 4.6833 0.4779 6.6385 1.8767 3.7203 12.0575 0.9676 34.6769 3.2382 8.1151 1.9402 9.7057 3.1170 8.4383 1.9715 21.6858 25.1381 4.9068 15.8180 1.3398 62.4460 95.6830 3.7660 9.9153 54.6132 9.6514 4.4380 31.9832 114.6977 0.9405 31.9222 4.5698 0.3953 1.2408 0.6528 3.5714 1.6588 12.5817 12.5052 65.8794 24.3774 26.9001 17.4281 1.2078 1.5431 6.9711 6.3064 7.8612 1.9545 2.7335 13.3000 13.0836 0.8991 16.3415 1.5227 30.0104 20.6916 29.8822 18.6045 11.1296 56.8081 51.7049 16.9598 30.8209 11.2499 10.5348 8.5923 42.1219 95.2651 34.3049 49.0752 27.8177 30.4526 15.2206 16.5187 25.9507 23.8345 34.1464
temp: 298.150 k
press: 1.00000 atm
elementType: 8 8 6 6 6 6 6 6 6 6 6 6 6 1 1 1 1 1 1 1 1 1 1 1 1 1 1 1 1 1 1 1 1 1 1
symmnumber: 1
zpe: 815575.0 jmol-1
zpe.correction: 0.310636 hartree
zpe.thermalcorrener: 0.326227 hartree
zpe.thermalcorrenthalpy: 0.327172 hartree
zpe.thermalcorrgfe: 0.270281 hartree
zpe.sumelectzpe: -581.721991 hartree
zpe.sumelectthermal: -581.706399 hartree
zpe.sumelectthermalent: -581.705455 hartree
zpe.sumelectthermalfe: -581.762346 hartree
dipole: 0.8307 -0.1985 -0.1754
dipole: 0.8719
quadrupole: -80.9975 -81.4267 -83.6654
quadrupole: -2.4082 1.5096 2.7584
quadrupole: 1.0324 0.6032 -1.6356 -2.4082 1.5096 2.7584
hfenergy: -582.0326268 hartree
pointgroup: C01 [X(C11H22O2)]
dipole: 0.3241916 -0.0885241 -0.06878 debye
polarizability: 136.4131144|-4.1062822|127.6598619|1.1768743|1.6263653|108.5085263 unknown
InChI: InChI=1S/C11H22O2/c1-8(2)9-10(3,4)7-12-11(5,6)13-9/h8-9H,7H2,1-6H3
charge 0 multiplicity 1
35 atoms
O  -0.574867 0.781352 -0.598519
O  -1.780368 -0.91105 0.617219
C  0.605451 -1.332634 -0.042694
C  0.59946 0.235102 0.142969
C  1.822115 1.045094 -0.357336
C  -0.893185 -1.759937 -0.196632
C  -1.86361 0.456939 0.046103
C  1.18447 -2.015605 1.223431
C  1.341135 -1.798586 -1.322457
C  1.570492 2.562459 -0.173061
C  3.138077 0.65382 0.360677
C  -2.17186 1.382015 1.230526
C  -2.912454 0.534065 -1.070662
H  0.461302 0.445253 1.226972
H  1.936386 0.846378 -1.441705
H  -1.194928 -1.716325 -1.262371
H  -1.051055 -2.784515 0.181516
H  2.205773 -1.670317 1.456991
H  0.541578 -1.804147 2.098568
H  1.222221 -3.113392 1.087119
H  1.151604 -2.875112 -1.499628
H  0.981422 -1.241731 -2.207367
H  2.434607 -1.665629 -1.251173
H  0.64579 2.873088 -0.684648
H  2.417477 3.145581 -0.580294
H  1.472904 2.815171 0.901395
H  3.448586 -0.385464 0.159898
H  3.955982 1.316514 0.022488
H  3.041871 0.777271 1.456826
H  -2.315287 2.416646 0.875811
H  -3.091155 1.043602 1.738396
H  -1.349798 1.365673 1.965718
H  -2.698711 -0.209058 -1.857685
H  -3.916799 0.3390 -0.658525
H  -2.899324 1.536181 -1.532665
