program: Gaussian 09
title: 000112449
version: EM64L-G09RevD.01
frameworkgroup: C1[X(C18H24N2)]
method: RPBEPBE
basis: SDD
operation: Freq
keyword: #pfreq=noraman
keyword: PBEPBE/SDD
title: #p freq=noraman PBEPBE/SDD
converged: YES YES NO NO
title: Mulliken charges:
elementType: N N C C C C C C C C C C C C C C C C C C H H H H H H H H H H H H H H H H H H H H H H H H
charge: -0.298410 -0.701766 -0.060851 -0.395738 -0.326168 -0.719147 -0.359542 0.361154 0.373109 -0.699387 -0.356562 -0.365792 -0.360665 -0.383874 -0.414329 -0.420261 0.510255 -0.244364 -0.222368 -0.276196 0.217066 0.214907 0.184768 0.219169 0.166036 0.209923 0.216122 0.232141 0.189011 0.200555 0.215613 0.206010 0.214338 0.257757 0.243207 0.221293 0.257873 0.216137 0.214652 0.216418 0.217670 0.222538 0.304150 0.303546
chargesum: 0.00000
title: Mulliken charges with hydrogens summed into heavy atoms:
elementType: N N C C C C C C C C C C C C C C C C C C
charge: -0.298410 -0.094070 0.156215 0.003937 0.059037 -0.060961 0.030023 0.361154 0.373109 -0.063425 -0.098805 -0.122585 -0.139372 -0.126001 -0.198192 -0.205608 0.510255 -0.027946 -0.004697 -0.053658
polarizability: 2.66409475e+02 3.58905109e+01 2.17063376e+02 1.53772159e+01 -6.88021170e+00 1.68295452e+02
1716.lowfreq: -9.8753 -7.2900 -0.0003 0.0003 0.0006 7.6341 19.7410 25.6381 36.0462
frequency: 19.1644 24.3323 35.9393 48.3921 60.0417 66.8928 84.7417 116.5045 144.0417 155.2516 177.6075 193.1416 219.0398 222.3946 241.3453 257.6978 294.1781 323.7901 331.9255 355.6776 357.5501 369.4653 413.0536 415.7725 419.2396 463.1646 471.8170 496.8997 529.1498 554.0277 579.1623 615.4885 639.0363 673.1088 695.8748 723.1181 730.4376 751.1448 784.6303 807.5882 815.7898 819.0114 823.5805 868.8294 879.1550 884.8225 892.8203 911.5179 932.6415 951.5972 955.9815 957.9895 975.3334 978.7219 997.1409 1008.1227 1016.5358 1026.7507 1033.3485 1056.3165 1080.7166 1091.6967 1119.1326 1125.3987 1140.0640 1161.0682 1168.2905 1181.5954 1191.5565 1212.4723 1234.2639 1252.4777 1271.7921 1286.7260 1292.2053 1305.5004 1309.5167 1316.5313 1324.0411 1339.2014 1350.7980 1364.6724 1379.0369 1385.6685 1387.2761 1400.1442 1435.0199 1446.8028 1458.0531 1466.2561 1473.4036 1474.9469 1475.7727 1477.5448 1486.2627 1489.0872 1511.1445 1571.1422 1577.6823 1614.1838 1631.0878 1644.5766 2948.8274 2964.3371 2970.7231 2977.5103 2983.4287 3000.5528 3003.7328 3025.6425 3050.2037 3066.8448 3070.7977 3075.0781 3092.2200 3115.3616 3117.9951 3118.4108 3125.5443 3144.9482 3150.5881 3151.7354 3162.4875 3182.6119 3569.6647 3709.9999
redmass: 3.9333 2.4955 3.7462 2.3633 3.4791 3.1619 3.3654 2.6068 2.4570 3.5790 3.7923 1.2442 2.3149 1.5167 2.4010 2.9794 4.0112 2.1332 1.5964 3.9740 1.0424 3.8031 2.9788 2.8678 3.2465 3.1617 2.9678 3.3517 3.5479 2.5156 4.2932 6.2200 6.5833 3.9877 1.8920 3.8191 1.1029 1.8031 1.2591 1.5105 2.9965 1.5609 1.3971 2.9741 1.4869 2.6245 1.6776 1.3557 1.3984 1.3535 2.2841 1.3494 1.2871 5.5030 2.6445 1.4731 1.4400 2.3337 2.6848 2.4848 2.2180 1.5910 2.4810 1.2257 1.9649 2.3362 1.0486 1.1299 1.1388 1.4675 3.0159 1.3100 1.5259 1.1496 1.4179 1.4599 1.3818 2.2573 1.5994 1.4227 1.6250 3.4786 5.1796 1.2108 1.2188 1.6214 3.4560 2.5499 1.0977 1.0692 1.0666 1.0481 1.0678 1.0851 1.0821 2.2872 3.0712 6.4264 6.5393 5.9814 2.3249 1.7069 1.0631 1.0598 1.0364 1.0601 1.0405 1.0841 1.0932 1.0978 1.1000 1.1003 1.0997 1.0989 1.0993 1.0883 1.0870 1.0855 1.0895 1.0949 1.0961 1.0932 1.0979 1.0931 1.0448 1.1040
irintensity: 0.4285 0.8368 0.4557 0.4254 1.5309 0.0600 1.0787 0.6201 0.9750 0.8720 2.0302 0.0334 0.3296 0.1225 0.7577 0.4652 0.9755 92.5352 202.8141 5.5798 0.7592 9.3335 1.5927 0.3734 3.6150 11.6658 0.0653 12.0629 1.9116 23.8212 13.9530 0.5833 0.3256 4.0424 41.0695 3.3258 11.5809 69.8499 2.4417 5.6900 4.4480 35.2162 24.4918 3.0400 6.2728 1.2410 2.5867 0.9716 1.1300 0.1309 2.2529 0.2109 0.9169 5.1350 1.3150 7.5962 0.1906 7.2244 7.6034 19.8610 1.9970 5.7806 32.6756 17.0809 31.5455 14.0182 0.4967 15.3225 8.7739 3.4537 52.7704 7.3694 76.1912 24.7835 50.9560 47.8326 22.4193 31.0698 0.3865 8.0144 0.9293 8.5954 5.5012 31.3095 4.0748 6.0353 1.8874 2.2183 5.0095 1.4565 3.4762 9.9017 6.4202 9.0244 20.4534 184.4649 307.5867 12.3436 4.6014 157.3610 0.7402 249.4780 20.4572 43.1111 35.0030 23.5115 50.9465 4.1940 11.1537 13.2215 34.1302 76.3224 61.7915 54.5365 39.9814 13.0204 42.9499 6.1068 19.2265 21.9934 2.5595 30.9044 25.1423 12.9061 86.3676 19.8553
temp: 298.150 k
press: 1.00000 atm
elementType: 7 7 6 6 6 6 6 6 6 6 6 6 6 6 6 6 6 6 6 6 1 1 1 1 1 1 1 1 1 1 1 1 1 1 1 1 1 1 1 1 1 1 1 1
symmnumber: 1
zpe: 988904.3 jmol-1
zpe.correction: 0.376654 hartree
zpe.thermalcorrener: 0.397372 hartree
zpe.thermalcorrenthalpy: 0.398316 hartree
zpe.thermalcorrgfe: 0.325475 hartree
zpe.sumelectzpe: -808.327592 hartree
zpe.sumelectthermal: -808.306873 hartree
zpe.sumelectthermalent: -808.305929 hartree
zpe.sumelectthermalfe: -808.378770 hartree
dipole: -2.9801 -1.9164 0.3661
dipole: 3.5620
quadrupole: -96.6695 -118.3038 -121.2390
quadrupole: 2.6839 7.6097 1.0964
quadrupole: 15.4013 -6.2330 -9.1683 2.6839 7.6097 1.0964
hfenergy: -808.7042455 hartree
pointgroup: C01 [X(C18H24N2)]
dipole: 1.2825515 0.5286391 0.1988206 debye
polarizability: 275.568527|29.065571|202.9086173|-12.5572606|14.3700443|173.2911594 unknown
InChI: InChI=1S/C18H24N2/c1-3-4-8-15(2)20(17-9-6-5-7-10-17)18-13-11-16(19)12-14-18/h5-7,9-15H,3-4,8,19H2,1-2H3
charge 0 multiplicity 1
44 atoms
N  -0.085236 -0.161718 0.549699
N  5.439297 0.2000 -0.861067
C  -0.504499 0.665109 1.72842
C  -1.813314 1.4666 1.494843
C  -1.746889 2.421334 0.283336
C  -0.50684 -0.132277 3.060716
C  -3.059525 3.207437 0.064494
C  1.305336 -0.07158 0.166397
C  -0.933336 -1.07786 -0.120423
C  -2.997847 4.151294 -1.155582
C  2.147145 -1.214809 0.209931
C  1.877764 1.162692 -0.236176
C  -2.127925 -1.605526 0.46014
C  -0.610598 -1.494854 -1.451923
C  3.507649 -1.132696 -0.137616
C  3.244004 1.261538 -0.565473
C  4.084837 0.112254 -0.526445
C  -2.95239 -2.496235 -0.260464
C  -1.436637 -2.391453 -2.155044
C  -2.620954 -2.903558 -1.571745
H  0.303621 1.415524 1.825415
H  -2.674832 0.784876 1.369846
H  -2.009118 2.051018 2.417468
H  -1.513366 1.836456 -0.628315
H  -0.911041 3.140957 0.422491
H  -0.605508 0.563102 3.91539
H  -1.33305 -0.860364 3.123106
H  0.443583 -0.684144 3.173699
H  -3.29532 3.793319 0.976936
H  -3.892415 2.487068 -0.067176
H  -2.793516 3.583171 -2.082573
H  -2.19299 4.901893 -1.038116
H  -3.949603 4.696331 -1.29553
H  1.719745 -2.177046 0.512934
H  1.240771 2.051751 -0.304329
H  -2.408092 -1.348895 1.483471
H  0.290896 -1.100605 -1.930871
H  4.134277 -2.03249 -0.097157
H  3.66095 2.229217 -0.871429
H  -3.859131 -2.883192 0.220201
H  -1.15687 -2.683816 -3.174315
H  -3.262572 -3.599098 -2.12276
H  6.034861 -0.621959 -0.838855
H  5.850178 1.084537 -1.143149
