program: Gaussian 09
title: 000112288
version: EM64L-G09RevD.01
frameworkgroup: C1[X(C9H22N2O)]
method: RPBEPBE
basis: SDD
operation: Freq
keyword: #p
keyword: freq=noraman
keyword: PBEPBE/SDD
title: #p freq=noraman PBEPBE/SDD
converged: YES YES NO NO
title: Mulliken charges:
elementType: O N N C C C C C C C C C H H H H H H H H H H H H H H H H H H H H H H
charge: -0.439034 -0.106530 -0.597134 -0.395721 -0.372575 -0.366016 -0.048031 -0.375594 -0.331161 -0.707572 -0.318595 -0.674036 0.226279 0.184681 0.184468 0.203691 0.213223 0.175970 0.177546 0.180396 0.224076 0.207772 0.189227 0.219721 0.201489 0.227272 0.232513 0.188287 0.211640 0.227395 0.205758 0.263336 0.258035 0.329223
chargesum: 0.00000
title: Mulliken charges with hydrogens summed into heavy atoms:
elementType: O N N C C C C C C C C C
charge: -0.109811 -0.106530 -0.075762 0.015240 0.015584 0.023177 0.129514 0.028878 0.065837 -0.059089 0.102204 -0.029243
polarizability: 1.37913665e+02 -9.52917909e-01 1.11158730e+02 -1.91503844e-01 2.11118035e+00 1.05502526e+02
1716.lowfreq: -14.7808 -14.0922 -3.8872 0.0005 0.0006 0.0007 26.9256 30.4933 50.7122
frequency: 26.1687 29.0335 50.6125 65.7665 83.6019 89.7142 111.2642 129.8298 178.9580 220.3901 228.9114 247.6463 251.8043 270.3389 282.7576 314.3359 349.0678 386.1375 402.3672 419.2642 460.6048 483.2646 539.0787 613.2629 736.2803 783.0917 792.9339 797.9758 820.0694 863.3832 944.4983 953.0756 965.6033 983.2891 1004.9303 1021.6291 1044.4191 1054.5900 1064.3641 1078.2118 1086.8354 1099.5360 1124.5306 1151.4174 1182.4790 1211.6602 1222.7092 1228.3420 1249.1893 1274.3003 1278.8681 1282.3646 1298.9553 1307.0099 1321.8695 1344.0767 1356.8537 1364.3393 1369.1313 1372.5015 1381.8748 1383.0881 1387.5133 1456.1987 1457.0337 1464.7072 1469.9271 1470.9643 1474.0219 1477.0876 1480.3659 1484.6724 1488.5505 1635.6191 2833.3044 2841.1454 2847.1500 2861.3603 2947.6338 2964.0410 2973.2627 2976.8139 2983.1255 3010.6935 3015.0587 3029.1412 3050.0490 3051.7009 3066.5450 3075.7121 3091.9069 3092.4859 3102.3177 3438.6613 3555.6879 3568.0374
redmass: 2.7864 4.3230 3.3659 2.6861 1.9771 2.3132 2.3365 2.0035 1.7337 1.5198 1.3543 2.2033 2.0146 1.5559 1.5541 1.2995 2.5389 2.8934 2.4548 2.7461 2.5757 2.7103 2.7598 1.3742 1.1460 2.4704 1.2074 1.1778 1.7095 1.6705 2.0358 3.4516 1.8308 1.4086 1.8206 2.3927 3.5059 2.3646 2.0699 2.4033 1.7861 1.9439 1.9979 1.5682 1.8940 1.8776 1.4774 1.6779 1.2614 1.1663 1.1633 1.0978 1.2264 1.3347 1.3503 1.2409 1.4908 1.3354 1.4011 1.5017 1.3522 1.3189 1.2388 1.0750 1.0635 1.0784 1.0651 1.0638 1.0681 1.0505 1.0748 1.0906 1.0731 1.0991 1.0714 1.0815 1.0710 1.0712 1.0630 1.0693 1.0634 1.0370 1.0357 1.0852 1.0952 1.0875 1.0924 1.0950 1.0977 1.0982 1.0998 1.1004 1.0964 1.0446 1.0660 1.0973
irintensity: 0.7130 0.2491 0.6069 2.4402 4.4715 0.4484 0.6863 1.3578 0.1246 4.7665 5.9116 4.3859 9.2372 18.6738 22.5692 145.0982 1.0618 13.6098 3.4302 2.8171 15.0845 4.3010 54.1777 165.2342 7.6125 6.6873 2.4499 7.1950 2.3772 1.5991 2.8626 105.6733 21.5270 1.8267 1.4806 8.9352 4.9768 40.1729 8.7665 21.3135 11.5613 14.2167 7.4194 20.8726 1.1220 3.8876 14.0869 29.0499 2.8646 0.3826 3.4635 1.0318 19.0834 23.4047 20.6286 31.3125 22.9787 1.8201 1.3906 7.6513 18.8356 17.9634 20.8878 0.2637 1.0404 0.6708 5.8191 1.3714 1.8433 10.6274 20.2611 7.0384 7.8148 50.7187 74.3222 91.4359 52.9142 195.6502 46.0915 62.1947 24.0183 29.7464 32.6472 29.7403 3.5645 17.6888 22.3689 79.2218 53.0175 60.1097 39.0064 37.9603 28.4500 3.0336 6.6362 0.3226
temp: 298.150 k
press: 1.00000 atm
elementType: 8 7 7 6 6 6 6 6 6 6 6 6 1 1 1 1 1 1 1 1 1 1 1 1 1 1 1 1 1 1 1 1 1 1
symmnumber: 1
zpe: 802436.8 jmol-1
zpe.correction: 0.305632 hartree
zpe.thermalcorrener: 0.322023 hartree
zpe.thermalcorrenthalpy: 0.322967 hartree
zpe.thermalcorrgfe: 0.260194 hartree
zpe.sumelectzpe: -539.810001 hartree
zpe.sumelectthermal: -539.793611 hartree
zpe.sumelectthermalent: -539.792666 hartree
zpe.sumelectthermalfe: -539.855439 hartree
dipole: 1.9176 2.0357 -1.9107
dipole: 3.3870
quadrupole: -83.0576 -79.0264 -75.7093
quadrupole: 0.6852 6.8171 2.4218
quadrupole: -3.7932 0.2381 3.5551 0.6852 6.8171 2.4218
hfenergy: -540.1156333 hartree
pointgroup: C01 [X(C9H22N2O1)]
dipole: -0.7620689 -0.6144532 -0.9041062 debye
polarizability: 137.8676035|-1.4576952|111.8157743|0.1231849|-0.7967039|104.8915433 unknown
InChI: InChI=1S/C9H22N2O/c1-3-11(7-8-12)6-4-5-9(2)10/h9,12H,3-8,10H2,1-2H3
charge 0 multiplicity 1
34 atoms
O  4.033346 2.160787 0.640137
N  1.481096 -0.512756 -0.260821
N  -4.745042 0.522702 -0.674906
C  -1.023185 -0.271759 -0.010359
C  0.2525 0.150374 -0.770703
C  -2.291474 0.397843 -0.583399
C  -3.612357 -0.077476 0.069811
C  2.696857 0.321946 -0.394229
C  1.649274 -1.902073 -0.761988
C  -3.723473 0.342966 1.54972
C  2.829323 1.322092 0.773589
C  2.484508 -2.784967 0.184469
H  -0.886403 -0.011737 1.055733
H  -1.137929 -1.374369 -0.053168
H  0.111851 -0.037836 -1.866504
H  0.377949 1.244774 -0.659586
H  -2.23409 1.499655 -0.477507
H  -2.344814 0.189779 -1.674837
H  -3.619013 -1.197719 0.031694
H  2.718603 0.881273 -1.366614
H  3.591885 -0.324831 -0.386277
H  0.641475 -2.346066 -0.858965
H  2.099331 -1.913853 -1.787335
H  -2.921856 -0.109559 2.159036
H  -4.691456 0.020469 1.979774
H  -3.661719 1.443191 1.632129
H  2.965033 0.776435 1.719767
H  1.916999 1.949759 0.859904
H  3.509962 -2.39403 0.314604
H  2.00954 -2.827935 1.179956
H  2.56713 -3.812726 -0.216277
H  -5.663066 0.339567 -0.255286
H  -4.737078 0.317465 -1.680189
H  3.968694 2.679815 -0.201475
