program: Gaussian 09
title: 000112255
version: EM64L-G09RevD.01
frameworkgroup: C1[X(C14H28O2)]
method: RPBEPBE
basis: SDD
operation: Freq
keyword: #pfreq=noraman
keyword: PBEPBE/SDD
title: #p freq=noraman PBEPBE/SDD
converged: YES YES NO NO
title: Mulliken charges:
elementType: O O C C C C C C C C C C C C C C H H H H H H H H H H H H H H H H H H H H H H H H H H H H
charge: -0.277083 -0.246180 -0.371454 -0.368428 -0.370563 -0.380519 -0.353516 -0.058529 -0.515699 -0.349218 -0.293061 -0.355754 -0.712212 0.265997 -0.714733 -0.696174 0.188250 0.190605 0.195925 0.202182 0.190663 0.188784 0.216866 0.204548 0.187518 0.187359 0.191311 0.230118 0.229325 0.212516 0.193988 0.239474 0.223494 0.195391 0.195239 0.208341 0.211554 0.230891 0.209266 0.222030 0.217009 0.209408 0.209655 0.215413
chargesum: 0.00000
title: Mulliken charges with hydrogens summed into heavy atoms:
elementType: O O C C C C C C C C C C C C C C
charge: -0.277083 -0.246180 0.007401 0.029679 0.008885 0.040895 0.021361 0.132783 -0.056255 0.057285 0.169908 0.034876 -0.061425 0.265997 -0.066427 -0.061698
polarizability: 1.77021633e+02 2.51502411e+00 1.56469198e+02 7.73218055e-02 -6.27567515e-01 1.39714913e+02
1716.lowfreq: -8.3684 -3.6921 -0.0003 0.0003 0.0005 7.3173 8.8007 21.2160 28.4294
frequency: 8.0122 20.0085 28.0878 35.8153 42.1278 52.3598 73.4248 93.8956 99.9024 109.0113 127.7490 145.8689 164.1525 186.0603 200.2162 212.5951 224.3776 227.6093 234.7532 274.1479 288.6066 331.3677 361.4824 398.6176 439.1440 454.1777 474.8744 549.1367 573.1765 651.7666 719.2644 728.5769 755.2136 767.7676 788.9297 816.4329 837.9045 859.7504 884.0048 890.7842 906.1733 927.7268 948.7217 965.4725 975.5229 998.1735 1018.2130 1023.5177 1038.5273 1049.7177 1052.5293 1069.7795 1079.6825 1100.0133 1112.4740 1116.9129 1130.6983 1173.1974 1182.5157 1192.3314 1208.0287 1220.4082 1235.0067 1237.0754 1261.1576 1268.7411 1276.7483 1280.5232 1288.9860 1289.3491 1293.0861 1315.8346 1318.9863 1338.3303 1344.5438 1348.0922 1353.5172 1357.0814 1362.4594 1387.6222 1389.8419 1391.7685 1445.0149 1456.5766 1459.3607 1462.0670 1465.8382 1466.1716 1467.6232 1474.5062 1475.6540 1476.9573 1479.5868 1482.3624 1484.0430 1487.8283 1490.9481 1634.4473 2949.0243 2949.1995 2954.6076 2955.0381 2960.8465 2967.7834 2971.1267 2972.6176 2978.1715 2982.4563 2982.5636 2983.9826 2991.8910 3002.5064 3004.6421 3008.2892 3020.2053 3032.8594 3035.5789 3050.1527 3066.7522 3067.9627 3068.9665 3070.3468 3071.2805 3074.0280 3080.7005 3084.8297
redmass: 3.9775 3.2691 4.0218 3.0179 1.9490 3.1827 3.3782 2.4096 1.6380 2.7360 2.3956 1.9325 2.8131 2.0584 1.2280 2.7529 1.2802 2.0742 1.5536 2.7426 2.8816 2.6830 2.0474 2.9016 2.5232 2.9231 3.4246 2.7176 4.3954 2.4939 1.0664 1.1188 1.3948 1.4950 1.6735 1.4882 2.3261 2.3711 1.8944 1.7979 1.6839 1.6371 1.6950 1.2810 2.5086 1.6163 2.5591 1.5361 2.6514 2.0972 3.0047 2.3901 2.1309 1.9985 1.6780 2.3571 1.9375 1.9604 1.9512 1.5455 1.7845 1.1528 1.4546 1.3728 1.2426 1.2751 1.2392 1.0654 1.1425 1.3238 1.1015 1.3067 1.3342 1.6079 1.4710 1.5253 1.6832 1.4562 1.5402 1.2184 1.2206 1.2156 1.0864 1.0759 1.0725 1.0756 1.0682 1.0649 1.0761 1.0745 1.0483 1.0503 1.0609 1.0832 1.0608 1.0880 1.0563 10.2849 1.0592 1.0591 1.0594 1.0809 1.0592 1.0590 1.0365 1.0360 1.0384 1.0589 1.0653 1.0926 1.0989 1.0624 1.1014 1.0597 1.1038 1.0999 1.1044 1.1036 1.1023 1.1008 1.0998 1.0993 1.0992 1.1034 1.0996 1.0996
irintensity: 0.1587 0.1275 0.2926 0.6533 0.1786 0.1027 0.0664 0.6182 0.0679 0.5058 0.4265 0.0223 1.9960 0.4202 0.8305 3.9493 0.6180 1.0941 0.5917 0.8040 4.0071 1.1169 1.4256 2.5345 1.1239 0.0176 1.5107 0.9057 4.9810 2.0032 14.7381 0.2609 11.8818 2.3827 3.0598 2.7832 6.7322 7.4591 3.4160 1.9365 2.3911 16.5150 37.6874 8.5527 32.8009 15.2614 7.3816 7.2470 7.7443 66.9595 8.1573 19.6352 0.4547 39.9431 9.4776 7.4868 1.6653 53.1828 2.1038 2.2684 104.5123 4.1404 27.7421 30.7507 1.0009 4.8364 7.0476 1.1654 0.5711 0.9653 0.4533 3.5016 1.4905 0.5889 1.9735 1.5421 1.0138 0.9630 2.1434 11.1883 11.3697 19.4487 16.1822 2.6396 0.6934 0.7724 1.2103 3.9329 1.5490 3.4068 11.4027 19.7647 10.7013 8.5813 13.6786 25.9046 9.1705 195.9150 0.1379 0.1457 4.6579 20.9558 26.5869 118.5859 39.1501 35.4747 21.3992 31.2385 63.6943 5.8218 0.9679 25.9305 1.7904 28.0326 1.4288 9.5230 77.0434 103.1682 17.8195 111.6136 36.8892 54.7581 94.7159 21.2489 39.5432 46.0590
temp: 298.150 k
press: 1.00000 atm
elementType: 8 8 6 6 6 6 6 6 6 6 6 6 6 6 6 6 1 1 1 1 1 1 1 1 1 1 1 1 1 1 1 1 1 1 1 1 1 1 1 1 1 1 1 1
symmnumber: 1
zpe: 1034815.5 jmol-1
zpe.correction: 0.394140 hartree
zpe.thermalcorrener: 0.415352 hartree
zpe.thermalcorrenthalpy: 0.416296 hartree
zpe.thermalcorrgfe: 0.339338 hartree
zpe.sumelectzpe: -699.412762 hartree
zpe.sumelectthermal: -699.391550 hartree
zpe.sumelectthermalent: -699.390606 hartree
zpe.sumelectthermalfe: -699.467564 hartree
dipole: 0.3555 1.3745 -1.7880
dipole: 2.2831
quadrupole: -101.0099 -100.2363 -107.4427
quadrupole: -7.2813 3.6464 7.2469
quadrupole: 1.8864 2.6600 -4.5464 -7.2813 3.6464 7.2469
hfenergy: -699.8069023 hartree
pointgroup: C01 [X(C14H28O2)]
dipole: -0.1137705 0.565836 0.6882653 debye
polarizability: 176.7877624|-3.3261267|156.7258722|-0.0333661|0.1579469|139.6921101 unknown
InChI: InChI=1S/C14H28O2/c1-4-6-7-8-9-10-11-14(15)16-12-13(3)5-2/h13H,4-12H2,1-3H3
charge 0 multiplicity 1
44 atoms
O  2.54288 -0.594258 0.079386
O  2.324767 -2.123928 -1.66203
C  -2.135175 -0.751866 0.804893
C  -0.916363 -1.445394 0.15673
C  -3.179543 -0.269248 -0.22744
C  0.147839 -1.877863 1.189606
C  -4.413297 0.403003 0.415624
C  3.521488 1.644212 -0.090619
C  1.35109 -2.62912 0.559906
C  2.209086 2.329334 0.379815
C  3.268693 0.329501 -0.844115
C  -5.44832 0.897319 -0.621327
C  4.493452 1.433795 1.094763
C  2.104151 -1.802646 -0.470918
C  1.212558 2.666615 -0.750428
C  -6.68421 1.55864 0.026156
H  -2.619571 -1.451116 1.518544
H  -1.786664 0.114117 1.406079
H  -1.257738 -2.330266 -0.419324
H  -0.455716 -0.754679 -0.579826
H  -3.512176 -1.130831 -0.843537
H  -2.697029 0.444221 -0.928189
H  0.522786 -0.988185 1.730242
H  -0.31864 -2.542959 1.943722
H  -4.082444 1.259897 1.039399
H  -4.903497 -0.313461 1.107848
H  4.010503 2.316698 -0.829852
H  1.016038 -3.551041 0.054207
H  2.061628 -2.915269 1.359355
H  1.717436 1.674966 1.125583
H  2.485418 3.262236 0.910717
H  2.651469 0.469709 -1.749201
H  4.214961 -0.157406 -1.145356
H  -5.771554 0.04116 -1.248353
H  -4.958745 1.617197 -1.308826
H  5.456156 1.00673 0.756361
H  4.706111 2.392059 1.60314
H  4.05576 0.740596 1.835164
H  1.690725 3.275474 -1.541529
H  0.805197 1.754711 -1.224539
H  0.354667 3.242432 -0.357329
H  -6.391666 2.435171 0.634772
H  -7.209044 0.848602 0.692962
H  -7.406767 1.902743 -0.736737
