program: Gaussian 09
title: 000112184
version: EM64L-G09RevD.01
frameworkgroup: C1[X(C21H26N2O3)]
method: RPBEPBE
basis: SDD
operation: Freq
keyword: #p
keyword: freq=noraman
keyword: PBEPBE/SDD
title: #p freq=noraman PBEPBE/SDD
converged: YES YES NO NO
title: Mulliken charges:
elementType: O O O N N C C C C C C C C C C C C C C C C C C C C C H H H H H H H H H H H H H H H H H H H H H H H H H H
charge: -0.449303 -0.317766 -0.437270 -0.355092 -0.412380 0.308720 -0.609909 -0.425866 -0.729824 -0.761301 -0.143393 0.507140 -0.306359 -0.370994 -0.376965 0.286736 -0.406133 -0.364921 0.111488 0.281961 0.256032 -0.398768 -0.377980 -0.380284 -0.200056 -0.232908 0.222719 0.219426 0.246697 0.223743 0.232880 0.240047 0.206510 0.218913 0.244447 0.203065 0.223117 0.210024 0.235396 0.230459 0.230961 0.236859 0.354099 0.216154 0.248115 0.245717 0.258555 0.228507 0.306000 0.218037 0.253549 0.351398
chargesum: 0.00000
title: Mulliken charges with hydrogens summed into heavy atoms:
elementType: O O O N N C C C C C C C C C C C C C C C C C C C C C
charge: -0.095204 -0.317766 -0.085872 -0.108395 -0.106380 0.308720 -0.167763 0.030757 -0.064353 -0.090673 0.066630 0.507140 0.159496 -0.140033 -0.140107 0.286736 -0.189979 -0.116806 0.111488 0.281961 0.256032 -0.153051 -0.119425 -0.151777 0.017981 0.020641
polarizability: 2.28317610e+02 -6.18188240e+00 2.66908398e+02 -2.84927267e+00 1.63954093e+01 2.51583926e+02
1716.lowfreq: -4.0971 -0.0009 -0.0007 -0.0005 2.2236 6.2120 8.1055 16.9241 21.3733
frequency: 7.8707 16.8619 21.2841 30.1717 37.4448 62.6596 73.6915 87.1951 105.3133 123.3319 164.3862 180.9338 185.1263 206.7784 214.2703 222.8049 233.6261 257.1505 264.7362 278.6332 288.7683 306.6770 317.0889 338.1235 351.2504 366.4111 394.6051 406.3884 415.0711 428.9759 437.3483 451.3477 474.5458 482.8980 502.7356 510.1902 517.3143 534.6997 568.3346 589.8784 591.7397 615.7816 619.0748 637.4383 645.8151 698.2024 719.7910 729.8702 745.0887 747.6504 774.9226 784.1341 808.6000 821.2385 829.7697 843.7157 845.6988 849.5246 860.1959 882.7683 889.9404 892.7088 905.3466 923.4720 930.3420 935.5307 941.8016 957.9386 965.1124 1002.0784 1005.0265 1006.5684 1026.7258 1063.1918 1070.5585 1078.6100 1082.2644 1100.4238 1110.3738 1127.0340 1130.0593 1144.1366 1168.5261 1180.8974 1181.5402 1186.8207 1210.4539 1218.4595 1221.3633 1230.3191 1236.2783 1246.4966 1251.2752 1276.8887 1280.9435 1306.4860 1322.3759 1328.0377 1342.3392 1352.5013 1361.8741 1372.7256 1375.1359 1376.7688 1387.6874 1390.1670 1421.7130 1425.3473 1452.0131 1452.1536 1457.3406 1461.1469 1463.9959 1468.1836 1481.8291 1483.4651 1490.0681 1497.2961 1503.9896 1507.9649 1596.0001 1596.2192 1626.4575 1627.9909 2933.1712 2969.6862 2973.5199 2982.4166 2988.8411 3026.1552 3047.4974 3054.3674 3057.0511 3060.9358 3066.0932 3078.4049 3096.2303 3107.3129 3126.9887 3132.8761 3136.5879 3154.0580 3168.1282 3171.5372 3219.7630 3245.5457 3416.3680 3524.6085 3581.8898 3614.2607
redmass: 6.9597 4.8495 3.7027 4.7412 5.6142 5.9387 3.2062 5.4586 4.1808 3.9592 3.8859 5.1296 4.6182 2.0837 1.4989 4.0369 2.9319 1.8878 1.2573 4.0475 4.4677 2.8933 3.0199 4.2173 1.1342 2.3929 2.5131 2.6809 2.8974 2.5497 1.4223 2.5300 2.9901 3.9940 4.1055 3.0555 1.6016 2.2366 3.2430 3.5921 3.8254 5.4084 3.5086 6.6247 1.5853 3.7830 1.4911 4.9117 1.3020 3.0467 4.5943 3.4398 1.4233 4.6904 2.0582 2.6110 1.9595 2.0239 1.3478 1.8548 2.8290 2.7727 2.7979 1.3950 1.4425 1.8520 1.6091 1.6252 1.5554 1.6844 1.9727 1.8997 2.0206 1.8996 1.9919 2.0491 1.7623 2.9918 1.6964 1.4454 1.4856 1.3724 1.3976 1.1441 1.2836 2.2171 2.1756 2.0483 1.6789 1.9343 1.5991 2.8718 1.4081 2.1088 2.1817 1.4434 1.2788 1.3268 1.6615 1.4843 1.4181 1.2443 3.7517 1.4264 1.2723 4.7771 2.5917 2.7599 3.2531 1.2382 1.2967 1.0579 1.0996 1.0574 1.0840 1.0683 1.0841 2.6268 2.7203 4.5983 6.0785 6.3151 6.4340 8.5063 1.0685 1.0362 1.0375 1.0557 1.0596 1.0850 1.1014 1.0942 1.1064 1.0978 1.0982 1.0990 1.0987 1.0878 1.0896 1.0860 1.0955 1.0938 1.0953 1.0960 1.0908 1.1066 1.0740 1.0652 1.0660 1.0810
irintensity: 0.1625 0.1608 0.7332 0.6495 0.5675 0.2474 0.6127 0.4955 2.8853 0.6944 7.2653 0.4652 5.7388 3.5254 0.6731 6.4878 1.9708 0.6776 0.4468 1.8944 1.9540 6.1167 6.1331 1.0065 138.9713 0.5485 4.7763 7.3320 2.0911 1.5657 109.2018 58.0638 6.8559 3.0071 28.4903 14.7405 74.2979 11.8925 16.3086 1.8285 12.5711 0.9814 3.8444 0.7253 66.7435 2.4707 0.6393 7.3381 195.0933 10.2316 12.8859 3.3772 23.7429 4.1643 14.9544 24.0239 9.8524 13.1197 3.8957 1.2531 2.6504 17.6655 14.8413 0.4581 1.6432 3.4508 9.2079 0.2507 0.5748 40.2376 10.2844 5.0428 74.2423 11.8555 55.7171 100.1498 3.0648 50.2437 76.4068 18.3377 12.8171 219.3802 81.1180 3.4577 9.9046 27.5728 16.1151 11.3450 12.0664 152.8598 7.4509 26.6530 11.8061 2.7510 24.7455 14.9054 24.1500 1.2544 27.3088 24.3235 2.7063 35.4628 35.1604 52.5380 23.7198 12.3038 6.7514 12.6755 77.5902 2.6150 32.2068 2.5353 3.5984 1.2583 13.1204 7.3835 13.9256 63.0203 104.0613 0.9770 69.3500 19.0284 29.6246 15.3937 56.4282 29.1882 34.9324 25.3501 31.0691 28.2676 6.8152 20.5006 31.6985 17.9786 69.8012 33.9400 32.6154 20.2227 17.0307 3.5424 13.4803 26.9363 6.8326 12.6678 0.2154 3.6826 2.8561 19.2864 37.2519 62.2081
temp: 298.150 k
press: 1.00000 atm
elementType: 8 8 8 7 7 6 6 6 6 6 6 6 6 6 6 6 6 6 6 6 6 6 6 6 6 6 1 1 1 1 1 1 1 1 1 1 1 1 1 1 1 1 1 1 1 1 1 1 1 1 1 1
symmnumber: 1
zpe: 1127785.5 jmol-1
zpe.correction: 0.429551 hartree
zpe.thermalcorrener: 0.454818 hartree
zpe.thermalcorrenthalpy: 0.455762 hartree
zpe.thermalcorrgfe: 0.371448 hartree
zpe.sumelectzpe: -1149.060446 hartree
zpe.sumelectthermal: -1149.035178 hartree
zpe.sumelectthermalent: -1149.034234 hartree
zpe.sumelectthermalfe: -1149.118548 hartree
dipole: 0.1502 -2.4665 -0.8826
dipole: 2.6240
quadrupole: -158.0113 -142.8240 -142.2001
quadrupole: 21.1253 -11.1728 17.5049
quadrupole: -10.3328 4.8544 5.4784 21.1253 -11.1728 17.5049
hfenergy: -1149.4899965 hartree
pointgroup: C01 [X(C21H26N2O3)]
dipole: 0.2810223 -0.9033063 -0.4133159 debye
polarizability: 234.088727|-13.7115961|260.370424|-10.4763555|14.6125191|252.3507823 unknown
InChI: InChI=1S/C21H26N2O3/c1-21(2,12-15-6-8-16(24)9-7-15)23-13-17(25)14-26-20-5-3-4-19-18(20)10-11-22-19/h3-11,17,22-25H,12-14H2,1-2H3
charge 0 multiplicity 1
52 atoms
O  -2.826751 3.378927 -1.401215
O  -2.551534 0.79661 -0.456767
O  6.426506 -2.131348 0.849497
N  0.241741 3.015152 0.761017
N  -3.296176 -3.565171 -1.93119
C  1.632399 2.445358 0.75473
C  1.492274 0.879287 0.711752
C  -0.543674 2.999037 -0.493235
C  2.482698 2.970551 -0.436162
C  2.284397 2.886756 2.085588
C  -2.055371 3.119607 -0.176714
C  2.791807 0.088596 0.725903
C  -2.596171 1.881436 0.547695
C  3.449189 -0.271132 -0.478616
C  3.384459 -0.332453 1.947733
C  -3.015627 -0.474571 -0.079867
C  4.656781 -1.003322 -0.4736
C  4.588601 -1.06428 1.975788
C  -2.979294 -1.472515 -1.093935
C  5.227742 -1.396535 0.760132
C  -3.438285 -2.794541 -0.770607
C  -3.49462 -0.80555 1.203838
C  -2.560104 -1.478785 -2.477647
C  -3.923045 -3.146977 0.512357
C  -3.940736 -2.131434 1.485312
C  -2.766511 -2.770525 -2.959707
H  0.865032 0.602348 1.579739
H  0.914102 0.609666 -0.192908
H  0.251558 3.95958 1.173264
H  -0.375081 2.042198 -1.018632
H  -0.287003 3.816099 -1.203383
H  3.505381 2.55541 -0.407051
H  2.556555 4.074087 -0.397071
H  2.03161 2.693019 -1.406773
H  3.300311 2.469984 2.185529
H  2.366027 3.990758 2.131488
H  1.676727 2.548694 2.944758
H  -2.227743 4.006112 0.462195
H  -1.948249 1.636707 1.410437
H  -3.643882 2.036859 0.870389
H  3.006518 0.01924 -1.439053
H  2.887181 -0.091965 2.895076
H  -2.947653 2.502114 -1.853018
H  5.142009 -1.271948 -1.421528
H  5.038846 -1.390674 2.918017
H  -3.528951 -0.056286 1.999333
H  -2.157745 -0.639968 -3.040415
H  -4.268814 -4.159418 0.744639
H  -3.539045 -4.549734 -2.011996
H  -4.306583 -2.357876 2.492887
H  -2.57871 -3.184028 -3.948821
H  6.788405 -2.320355 -0.051582
