program: Gaussian 09
title: 000112154
version: EM64L-G09RevD.01
frameworkgroup: C1[X(C24H32O3)]
method: RPBEPBE
basis: SDD
operation: Freq
keyword: #pfreq=noraman
keyword: PBEPBE/SDD
title: #p freq=noraman PBEPBE/SDD
converged: YES YES NO NO
title: Mulliken charges:
elementType: O O O C C C C C C C C C C C C C C C C C C C C C C C C H H H H H H H H H H H H H H H H H H H H H H H H H H H H H H H H
charge: -0.255589 -0.316704 -0.249831 -0.009108 -0.590631 -0.360911 -0.734284 0.516059 -0.360600 -0.348230 -0.710724 -0.404095 -0.354924 -0.377094 -0.426489 -0.317157 -0.421325 -0.328668 0.377040 -0.693556 0.364601 0.215970 -0.346365 -0.368768 0.146087 -0.344493 -0.307979 0.201530 0.205322 0.204722 0.183026 0.225143 0.223192 0.210913 0.208086 0.188559 0.189025 0.191100 0.191032 0.214151 0.216897 0.209446 0.215879 0.216232 0.195265 0.195207 0.234271 0.235304 0.211509 0.211380 0.247790 0.302157 0.217380 0.210701 0.210691 0.253763 0.254184 0.266717 0.267198
chargesum: 0.00000
title: Mulliken charges with hydrogens summed into heavy atoms:
elementType: O O O C C C C C C C C C C C C C C C C C C C C C C C C
charge: -0.255589 -0.316704 -0.249831 0.192422 -0.180588 0.047258 -0.092092 0.516059 0.016984 0.033902 -0.070230 0.028016 0.035547 -0.142823 -0.191185 0.105731 -0.173536 -0.026511 0.377040 -0.054785 0.364601 0.215970 -0.092602 -0.114585 0.146087 -0.077776 -0.040781
polarizability: 4.95520094e+02 2.77089744e-01 2.41474495e+02 -1.01100673e+01 1.40614169e+01 1.72108559e+02
1716.lowfreq: -14.9548 -9.3237 -0.0025 0.0011 0.0028 1.1396 3.6892 12.5201 18.0131
frequency: -11.7956 12.1793 16.7661 23.3819 30.2527 33.9224 45.9561 48.6361 64.9754 65.6349 72.9669 97.3313 107.2057 115.4479 120.0601 139.9788 143.5133 155.2670 177.5386 197.8746 209.5050 219.5819 231.4531 238.7433 261.2335 278.2269 296.7268 311.4975 318.4789 354.4799 364.5156 390.3660 401.3807 411.2470 416.9735 419.9905 462.8166 467.9955 504.6322 513.0538 525.5032 567.6061 623.9157 628.8674 641.9584 667.0700 714.6227 725.4476 747.3674 750.2680 752.1708 759.6553 778.7849 791.9130 804.9470 811.0294 828.7381 829.9663 837.4279 851.6983 855.5573 889.8861 891.9360 892.8863 925.6697 957.3991 960.8793 961.9278 977.3502 980.8468 985.9295 989.2248 991.5242 995.8942 1008.1842 1012.4792 1034.3624 1046.8257 1048.7575 1071.9002 1076.0375 1085.0353 1117.3188 1123.1161 1126.9980 1132.1591 1147.3327 1150.1835 1153.1847 1171.0629 1195.5108 1196.5369 1206.1280 1216.2044 1231.3139 1239.2588 1246.8397 1247.7205 1268.3958 1278.5702 1280.2760 1290.4641 1294.5335 1296.9179 1297.3145 1299.5840 1310.8233 1338.8000 1342.6602 1343.3676 1358.0128 1373.5323 1378.6649 1381.4221 1385.3703 1388.7043 1390.5954 1410.6821 1431.2930 1461.6914 1463.8333 1465.7019 1468.0952 1470.4267 1473.8730 1476.5235 1477.3155 1478.1475 1483.3191 1484.1277 1488.8030 1489.3543 1490.2200 1497.5944 1570.1717 1581.8765 1613.8449 1618.5092 1623.4310 2951.1069 2951.4140 2954.9473 2959.2826 2963.4306 2967.0062 2969.4362 2971.4164 2973.2175 2975.7549 2991.5245 2995.4595 3007.3672 3011.7205 3021.3678 3027.1861 3033.2152 3058.4871 3064.0507 3068.5765 3069.9969 3072.0266 3073.1977 3078.3787 3123.3168 3128.4838 3149.9007 3160.7178 3162.4914 3170.3061 3185.7037 3210.6331
redmass: 2.8315 4.1652 4.1478 4.1620 3.2053 3.2035 2.8953 2.9794 3.5958 2.8757 4.5323 3.1488 2.1947 2.8173 3.6361 2.5627 4.5059 2.6206 5.0639 1.0373 3.4294 1.8810 1.1219 3.2429 2.4596 2.8993 4.8906 4.3874 4.1159 4.8042 3.1211 3.6981 2.2692 2.9738 2.9954 3.2898 3.2249 4.0806 3.0118 3.7879 3.3829 4.2151 6.7669 6.9803 6.7748 4.3599 3.7423 1.0674 5.6654 1.1085 4.3494 1.6369 5.4275 1.5279 1.1645 4.3153 1.2598 4.9029 1.4822 1.6436 1.5224 1.8351 1.2097 1.6804 1.6502 1.3479 7.8441 1.2033 1.3542 1.3407 1.3254 1.1556 1.8165 3.6929 2.8760 3.7924 3.6343 2.9927 3.0964 2.6805 1.4777 2.0964 1.3174 1.3663 2.6829 2.0384 1.4362 2.0832 1.9422 1.2494 1.5393 1.3909 1.5378 2.9159 2.9818 1.2974 1.3045 4.1593 1.2424 1.2855 1.0764 1.1339 1.0925 1.2788 1.3156 1.2931 1.3067 1.4845 1.5262 1.4296 1.6311 2.8218 3.6191 1.3300 2.0157 1.2174 1.2046 3.1060 4.4321 1.0717 1.0750 1.0719 1.0878 1.0986 1.0469 1.1040 1.0428 1.0704 1.0563 1.1340 1.9202 1.3103 1.0594 2.0542 7.8246 7.0807 7.0399 7.2398 8.4079 1.0558 1.0754 1.0582 1.0588 1.0665 1.0431 1.0592 1.0543 1.0362 1.0371 1.0980 1.0592 1.1014 1.1064 1.0983 1.1016 1.1047 1.0989 1.1051 1.0993 1.1009 1.0996 1.0993 1.0982 1.0893 1.0908 1.0880 1.0889 1.0953 1.0959 1.0964 1.0940
irintensity: 0.0094 0.1866 0.2324 0.1799 0.0507 0.2174 0.0880 0.2617 0.1513 0.2351 0.6839 0.6767 0.0573 0.9528 0.3942 0.1659 0.6940 4.0562 1.0278 0.0142 2.8086 0.3658 0.0092 1.0718 0.7060 0.5714 0.8180 5.1077 1.1275 1.2010 2.8884 0.0903 1.4318 0.2181 0.0610 0.5723 0.8295 1.3523 5.5423 12.6116 9.6833 18.0291 2.8697 11.9202 37.4800 25.0515 1.1231 12.1223 4.4073 0.9943 11.6744 9.6756 14.0112 5.1745 6.6155 7.5434 2.0107 7.1067 5.3631 42.6360 61.1564 7.8182 2.1640 6.3095 3.3277 1.8324 152.5800 5.6673 0.8789 2.1927 0.0306 0.3181 17.7939 103.4737 11.4100 1.9982 357.8106 3.0078 17.6702 19.6364 15.5829 10.6507 11.1312 18.7110 17.1837 2.7566 2.5187 481.2565 149.3915 251.6327 0.0737 126.7236 9.0385 31.3798 68.6869 4.6125 5.0907 677.2818 1.6009 0.4741 0.0321 0.0033 1.0801 2.2766 2.6234 1.4550 3.7733 2.4671 4.3833 0.7880 0.2372 6.0691 6.2523 27.7631 37.3088 14.3212 11.8825 14.0090 3.3688 0.3087 0.3012 0.2143 7.2335 18.4782 12.9264 7.7887 12.6951 8.6487 16.3816 25.1334 92.2101 88.6806 13.8116 61.3675 4.1194 2.4078 219.5538 158.3931 128.6948 15.6414 3.9566 14.6210 11.6491 31.6200 9.3725 91.9452 91.6718 39.1421 36.6384 1.3541 37.7675 4.4445 17.0003 17.5253 22.2014 36.1144 41.1629 49.0441 64.2220 117.9647 54.8190 53.7048 48.7341 18.3181 23.7905 3.7424 3.2288 6.0295 15.8958 3.6505 4.1813
temp: 298.150 k
press: 1.00000 atm
elementType: 8 8 8 6 6 6 6 6 6 6 6 6 6 6 6 6 6 6 6 6 6 6 6 6 6 6 6 1 1 1 1 1 1 1 1 1 1 1 1 1 1 1 1 1 1 1 1 1 1 1 1 1 1 1 1 1 1 1 1
symmnumber: 1
zpe: 1314337.5 jmol-1
zpe.correction: 0.500605 hartree
zpe.thermalcorrener: 0.528932 hartree
zpe.thermalcorrenthalpy: 0.529876 hartree
zpe.thermalcorrgfe: 0.436997 hartree
zpe.sumelectzpe: -1157.396757 hartree
zpe.sumelectthermal: -1157.368430 hartree
zpe.sumelectthermalent: -1157.367486 hartree
zpe.sumelectthermalfe: -1157.460365 hartree
dipole: -2.8182 -0.9350 0.2685
dipole: 2.9813
quadrupole: -121.9426 -161.3459 -167.7227
quadrupole: -9.2793 -3.4800 2.2290
quadrupole: 28.3945 -11.0088 -17.3856 -9.2793 -3.4800 2.2290
hfenergy: -1157.897362 hartree
pointgroup: C01 [X(C24H32O3)]
dipole: -1.1080793 0.1883109 -0.3353954 debye
polarizability: 495.5256089|6.5212884|221.0583885|7.640561|-34.5948292|192.5191504 unknown
InChI: InChI=1S/C24H32O3/c1-4-6-7-8-17-26-22-15-11-21(12-16-22)24(25)27-23-13-9-20(10-14-23)18-19(3)5-2/h9-16,19H,4-8,17-18H2,1-3H3
charge 0 multiplicity 1
59 atoms
O  -4.690011 0.391622 -0.185866
O  1.618513 0.093903 0.589912
O  1.075646 -1.842742 1.822879
C  8.070947 -0.082501 -0.519884
C  7.392123 0.359251 0.817709
C  7.837372 -1.591507 -0.79693
C  9.574727 0.277935 -0.488113
C  5.874138 0.260008 0.805671
C  -8.340234 -0.693493 0.097846
C  -9.654136 -0.091799 -0.449473
C  8.302394 -2.061333 -2.192913
C  -7.094938 0.134825 -0.295229
C  -10.905973 -0.911999 -0.062788
C  5.095993 1.18615 0.059698
C  5.187948 -0.758342 1.511588
C  -5.804588 -0.479575 0.248636
C  3.69251 1.09091 0.016821
C  3.778969 -0.878607 1.486323
C  3.038785 0.057008 0.726618
C  -12.214693 -0.305604 -0.61336
C  -3.391127 0.033602 0.174758
C  -0.677428 -0.509541 0.786612
C  -3.056851 -1.110735 0.948183
C  -2.368451 0.904398 -0.288489
C  0.722698 -0.852076 1.137465
C  -1.706796 -1.370452 1.246607
C  -1.026387 0.634203 0.013801
H  7.592727 0.490697 -1.343735
H  7.693785 1.40608 1.02438
H  7.805011 -0.259252 1.639541
H  8.358973 -2.181027 -0.01306
H  6.757611 -1.81115 -0.687113
H  10.074165 0.029222 -1.441235
H  9.722096 1.358939 -0.303804
H  10.092612 -0.275648 0.319479
H  -8.23148 -1.732392 -0.278449
H  -8.40633 -0.766442 1.203705
H  -9.76721 0.946807 -0.074741
H  -9.592165 -0.018446 -1.555212
H  9.395806 -1.963117 -2.320413
H  8.043275 -3.123409 -2.357766
H  7.814197 -1.46952 -2.990649
H  -7.021033 0.207019 -1.397195
H  -7.190733 1.168165 0.089531
H  -10.967025 -0.984917 1.042376
H  -10.791635 -1.949934 -0.437062
H  5.595269 1.99399 -0.489155
H  5.764548 -1.482357 2.099956
H  -5.648519 -1.502205 -0.153213
H  -5.821621 -0.529503 1.357145
H  3.089304 1.803837 -0.553725
H  3.271217 -1.672739 2.033494
H  -13.094101 -0.909631 -0.323996
H  -12.36843 0.720608 -0.229429
H  -12.191785 -0.249692 -1.718104
H  -3.829959 -1.791636 1.31459
H  -2.655857 1.777961 -0.880965
H  -1.426487 -2.246442 1.840964
H  -0.235578 1.299225 -0.341723
