program: Gaussian 09
title: 000112055
version: EM64L-G09RevD.01
frameworkgroup: C1[X(C10H14O3)]
method: RPBEPBE
basis: SDD
operation: Freq
keyword: #pfreq=noraman
keyword: PBEPBE/SDD
title: #p freq=noraman PBEPBE/SDD
converged: YES YES NO NO
title: Mulliken charges:
elementType: O O O C C C C C C C C C C H H H H H H H H H H H H H H
charge: -0.204112 -0.161998 -0.155222 -0.180486 -0.511342 -0.550925 0.168452 -0.185511 0.205123 -0.436618 -0.174711 -0.346979 -0.684560 0.275409 0.250288 0.221161 0.282420 0.275731 0.232483 0.201400 0.203609 0.226469 0.207182 0.199100 0.210592 0.211697 0.221348
chargesum: 0.00000
title: Mulliken charges with hydrogens summed into heavy atoms:
elementType: O O O C C C C C C C C C C
charge: -0.204112 -0.161998 -0.155222 0.094923 -0.039892 0.007226 0.168452 0.046972 0.205123 -0.031609 0.051759 0.059303 -0.040925
polarizability: 1.47388424e+02 8.66653030e+00 1.18820825e+02 -1.67264829e+00 -3.80122969e+00 8.36224596e+01
1716.lowfreq: -14.7279 0.0005 0.0007 0.0008 6.7507 7.8320 13.4368 31.5207 33.5982
frequency: 10.0306 31.2775 33.5648 67.2630 92.4760 120.1284 132.9952 167.9838 206.6031 231.4353 296.8731 305.7694 370.0357 384.0186 400.6527 511.7173 518.2161 558.0125 576.2548 589.9305 684.0015 737.7633 765.4013 808.0365 824.4036 858.7564 874.3123 888.2139 902.8864 972.0344 987.3730 1016.8294 1038.5467 1050.3631 1076.9143 1092.1282 1095.5248 1113.8216 1128.8468 1168.3851 1204.0735 1226.4260 1234.8132 1260.0163 1276.1653 1282.4453 1294.1907 1298.7645 1309.8373 1330.9092 1344.8682 1392.1355 1438.7106 1457.8747 1464.9784 1472.8752 1478.3562 1484.9896 1683.6938 1699.1434 1769.7116 2957.5357 2975.0745 2976.6218 2984.4206 3010.8801 3011.8873 3024.3824 3036.0292 3045.6141 3062.1148 3072.4463 3075.8258 3076.7512 3083.9315
redmass: 3.3053 3.0996 4.8902 1.8376 3.4997 2.8287 15.2762 3.0915 2.7827 1.1170 3.3290 2.7948 4.9732 2.8057 3.4815 3.0013 2.6212 4.1303 8.4646 5.7896 6.6736 1.1458 2.7851 3.2064 5.2726 1.4583 1.7621 1.9880 1.9129 1.4972 1.5622 2.2373 2.4184 2.8442 2.4855 2.2266 2.0343 1.7830 5.3666 1.6560 1.4042 1.3322 1.1801 1.2906 1.1344 1.4133 1.3315 1.2956 1.4244 1.3727 1.4837 1.2113 1.0764 1.0878 1.0957 1.0611 1.0428 1.0743 6.4874 12.9052 12.8585 1.0610 1.0382 1.0580 1.0594 1.0965 1.0833 1.0643 1.1014 1.1002 1.0941 1.1002 1.0910 1.0988 1.0995
irintensity: 0.3624 4.9693 1.1630 0.1119 2.2962 0.3832 2.5528 3.3547 1.6897 0.0284 2.2260 1.6935 7.5487 3.1413 3.2132 1.0799 0.9629 18.9984 12.4970 21.1359 19.8039 9.3599 5.8784 40.6061 215.1954 4.3722 12.6191 4.6037 7.5700 2.6578 134.6927 37.3160 80.6858 0.6487 43.4228 56.0342 7.7434 0.4115 124.7861 3.1252 0.8493 1.3753 0.9284 1.8170 0.5145 0.5156 2.3986 4.0208 0.9757 1.9072 0.9502 10.2708 25.4563 4.0588 12.5847 3.4728 12.8133 15.2744 5.9779 494.3493 132.2461 19.4850 62.0715 24.4838 13.4434 2.3859 4.0189 4.7897 19.7442 7.1637 6.5861 51.7153 71.7136 52.6682 5.5353
temp: 298.150 k
press: 1.00000 atm
elementType: 8 8 8 6 6 6 6 6 6 6 6 6 6 1 1 1 1 1 1 1 1 1 1 1 1 1 1
symmnumber: 1
zpe: 577128.0 jmol-1
zpe.correction: 0.219816 hartree
zpe.thermalcorrener: 0.233861 hartree
zpe.thermalcorrenthalpy: 0.234805 hartree
zpe.thermalcorrgfe: 0.175342 hartree
zpe.sumelectzpe: -614.126168 hartree
zpe.sumelectthermal: -614.112123 hartree
zpe.sumelectthermalent: -614.111179 hartree
zpe.sumelectthermalfe: -614.170642 hartree
dipole: 5.9770 -0.7284 1.4807
dipole: 6.2006
quadrupole: -99.0377 -90.7030 -72.9647
quadrupole: 2.2676 -4.6956 0.4922
quadrupole: -11.4692 -3.1345 14.6037 2.2676 -4.6956 0.4922
hfenergy: -614.3459842 hartree
pointgroup: C01 [X(C10H14O3)]
dipole: -2.3517381 -0.1836334 -0.621886 debye
polarizability: 146.9893138|-9.2658441|118.4562313|-1.6754038|6.445003|84.3861644 unknown
InChI: InChI=1S/C10H14O3/c1-2-3-4-5-6-8-7-9(11)13-10(8)12/h4-5,8H,2-3,6-7H2,1H3
charge 0 multiplicity 1
27 atoms
O  3.344315 0.358911 0.301442
O  3.285883 -1.942729 -0.088946
O  2.772342 2.615938 0.483955
C  1.26033 -0.554539 -0.565694
C  0.248428 -1.463504 0.201475
C  1.082725 0.960442 -0.330119
C  2.697525 -0.85968 -0.12518
C  -1.170949 -1.260711 -0.282108
C  2.425648 1.472925 0.183684
C  -3.619053 -0.600923 0.019864
C  -2.1948 -0.805189 0.487355
C  -4.115107 0.859487 0.209408
C  -5.589415 1.039781 -0.210223
H  1.192009 -0.803704 -1.641811
H  0.566484 -2.51386 0.053056
H  0.316477 -1.253491 1.286397
H  0.301925 1.177676 0.420746
H  0.808608 1.523763 -1.237729
H  -1.366505 -1.510401 -1.337647
H  -4.29579 -1.271359 0.591152
H  -3.713393 -0.888879 -1.045653
H  -1.994566 -0.561038 1.544434
H  -3.469475 1.540639 -0.379278
H  -3.991736 1.150515 1.272175
H  -6.255258 0.391559 0.390173
H  -5.734843 0.775801 -1.274606
H  -5.921407 2.084871 -0.073123
