program: Gaussian 09
title: 000111990
version: EM64L-G09RevD.01
frameworkgroup: C1[X(C10H12O3)]
method: RPBEPBE
basis: SDD
operation: Freq
keyword: #pfreq=noraman
keyword: PBEPBE/SDD
title: #p freq=noraman PBEPBE/SDD
converged: YES YES NO NO
title: Mulliken charges:
elementType: O O O C C C C C C C C C C H H H H H H H H H H H H
charge: -0.199937 -0.154317 -0.152441 0.168557 -0.276843 -0.468510 -0.547807 -0.754046 0.155883 0.432088 0.161717 -0.399309 -0.809788 0.279916 0.245754 0.235068 0.222559 0.253551 0.236554 0.219711 0.245311 0.223823 0.231080 0.220402 0.231024
chargesum: 0.00000
title: Mulliken charges with hydrogens summed into heavy atoms:
elementType: O O O C C C C C C C C C C
charge: -0.199937 -0.154317 -0.152441 0.168557 0.003074 0.012313 -0.071698 -0.052471 0.155883 0.432088 0.161717 -0.175485 -0.127283
polarizability: 1.24618064e+02 1.32959290e+01 1.10899136e+02 5.63976820e+00 5.64456916e+00 8.78748128e+01
1716.lowfreq: -15.9886 -6.4332 0.0004 0.0006 0.0007 5.9419 48.5546 74.0751 139.1455
frequency: 48.4860 74.0564 139.1450 152.9621 181.3543 205.8160 224.2623 239.5029 252.8742 307.0951 320.2633 344.9760 410.4557 434.5827 472.2808 517.9950 582.3666 596.3434 646.6590 671.8078 695.9778 745.4092 780.2623 809.7045 823.4375 871.8872 886.9408 914.6583 946.5367 982.3817 991.0399 1054.6512 1069.0792 1073.0491 1105.0285 1122.9861 1150.7137 1175.4366 1191.8806 1220.2517 1248.5586 1283.3973 1306.8785 1321.1568 1329.9147 1373.0930 1393.5040 1398.4914 1456.9223 1460.9920 1463.4235 1471.9983 1474.3705 1479.6848 1701.1743 1707.0374 1770.3532 2957.2731 2958.9135 2963.0271 2972.3691 2989.7145 3008.4875 3032.4020 3034.9282 3085.0916 3085.7371 3096.6837 3111.2318
redmass: 3.2969 4.9847 12.4836 1.3669 2.1245 1.1561 2.3387 2.7598 2.7084 3.1584 3.2552 3.5566 2.5447 3.6187 5.5962 5.1349 10.4374 4.7474 5.1176 4.9722 7.9751 4.4255 1.5928 4.8394 2.7943 2.8239 2.3858 1.9612 2.2152 1.7257 1.7278 1.7867 1.4971 3.0756 3.2376 1.9877 1.9213 2.2632 2.2169 1.3655 1.3577 1.7139 1.8232 1.5226 1.5206 2.0189 1.1989 1.2320 1.0750 1.0465 1.0795 1.0640 1.0526 1.0574 12.6585 6.6507 12.5316 1.0697 1.0674 1.0421 1.0672 1.0360 1.0991 1.0935 1.0967 1.0983 1.0996 1.1002 1.0912
irintensity: 1.3924 0.0558 3.6963 1.7549 0.8118 0.3530 3.1169 0.6400 4.4206 5.3175 1.0889 6.8426 3.0249 3.6652 5.1826 20.3113 1.9018 1.3247 2.2392 12.7551 4.1974 4.3110 26.3991 173.5730 80.0499 52.5346 26.0130 4.2215 1.1039 3.9622 2.4952 36.8159 19.5613 51.5271 61.5227 5.5015 33.0519 3.1724 12.2958 4.5325 0.5566 6.9424 3.6299 5.6681 1.2122 5.1198 22.2018 13.9179 13.7642 15.3419 7.4163 25.2060 0.7900 10.5185 453.6252 11.1018 98.6289 4.3424 21.5196 44.1496 32.2060 17.5610 7.6239 16.2625 22.3049 13.5015 29.7478 11.0666 24.7864
temp: 298.150 k
press: 1.00000 atm
elementType: 8 8 8 6 6 6 6 6 6 6 6 6 6 1 1 1 1 1 1 1 1 1 1 1 1
symmnumber: 1
zpe: 522597.1 jmol-1
zpe.correction: 0.199047 hartree
zpe.thermalcorrener: 0.211309 hartree
zpe.thermalcorrenthalpy: 0.212253 hartree
zpe.thermalcorrgfe: 0.160943 hartree
zpe.sumelectzpe: -612.963236 hartree
zpe.sumelectthermal: -612.950974 hartree
zpe.sumelectthermalent: -612.950030 hartree
zpe.sumelectthermalfe: -613.001340 hartree
dipole: 4.5156 -2.8666 2.0939
dipole: 5.7439
quadrupole: -86.1673 -85.7475 -71.9091
quadrupole: 0.5109 -3.0665 3.7358
quadrupole: -4.8927 -4.4729 9.3655 0.5109 -3.0665 3.7358
hfenergy: -613.162283 hartree
pointgroup: C01 [X(C10H12O3)]
dipole: -1.7720023 1.0920886 0.8798796 debye
dipolederiv: -0.9501891 -0.530734 0.1352785 -0.4989295 -1.3735393 -0.0610257 0.1891108 -0.065726 -0.2620413 -0.9898389 -0.343577 0.0578065 -0.2929627 -0.6751424 -0.020762 0.1328332 0.0100984 -0.3016077 -0.5018193 -0.1684084 0.0345261 -0.1909848 -1.0643929 -0.1139174 0.0367277 -0.2126195 -0.3475781 -0.313618 0.123246 0.0886397 0.0246473 0.035178 0.0223066 -0.0238316 0.0182975 0.0780129 -0.0136354 0.0040148 0.090029 0.1202209 -0.1869173 -0.1297236 0.178025 -0.1914647 -0.0283873 -0.0166786 0.0004864 -0.0140268 -0.0079392 0.1526573 0.0145624 0.1794876 0.0157968 0.067621 0.0031635 -0.0278982 -0.0362446 0.0280242 0.0247028 0.0592377 -0.0861312 0.0898384 0.0997 0.0258368 0.0015831 0.0026353 -0.0101526 -0.0023071 -0.0291871 -0.0009387 -0.029078 0.0404674 1.3666417 0.2239064 -0.1354246 0.5188173 1.5756547 0.0889018 -0.1184652 0.2156766 0.2153318 0.2283658 0.0255211 0.0315411 0.0114386 0.0618722 -0.1658183 0.0646913 -0.1649222 0.0468637 1.1352555 0.6777481 -0.2190159 0.2711527 1.4416862 0.2077027 -0.3929184 0.2046913 0.4343928 0.0900824 -0.0043483 0.0217808 -0.0404462 -0.2019392 -0.0731819 -0.0310753 -0.1122256 -0.1322621 -0.113431 0.0031061 -0.0267885 -0.0193478 0.0519413 0.0292346 -0.0144739 0.0331583 0.0663941 0.0137535 0.0333606 -0.0635202 0.0314419 0.0691994 0.0125902 -0.0796957 0.0442544 -0.0404943 -0.0448981 -0.0150233 0.0774528 0.050781 0.0403925 -0.1107957 0.0396232 -0.0737301 -0.034423 -0.0001005 -0.050376 0.011024 -0.0538806 -0.1036411 0.0673841 -0.03245 0.0331613 0.0873468 0.0107804 0.0412375 0.039525 0.0420087 0.0768074 -0.0538221 0.0736287 0.010206 -0.1293912 0.0625583 -0.0337751 -0.020325 -0.0837654 -0.0630497 0.0346729 -0.0300234 -0.0263732 0.084005 -0.0785683 0.0873372 0.0531364 0.0487975 0.066873 -0.0146333 0.0323439 -0.011675 0.0772142 0.0573471 0.0158187 -0.0820141 0.0433584 0.0461556 0.0839931 -0.085403 0.0207585 -0.0938558 0.0531004 -0.104179 0.0166389 -0.0607148 -0.0276534 0.0203784 0.0532842 0.0712168 0.0550473 -0.0665665 0.0638389 -0.092753 0.0484746 0.0636073 0.1078521 -0.0813962 0.0972245 0.040418 0.0119841 0.0280911 -0.0331927 0.1015885 0.0102526 0.1066653 -0.1094549 0.1005414 -0.0051408 0.0093821 -0.0140797 0.0533387 0.0250346 0.1012693 -0.0425166 0.1272322 -0.0379959 -0.121085 0.021092 -0.0368971 0.0099526 -0.1066625 -0.1196671 -0.0400982 -0.0207303 -0.0391101 0.1034516 unknown
polarizability: 124.40366|13.482237|111.362904|-5.5390093|-5.0036879|87.6254492 unknown
InChI: InChI=1S/C10H12O3/c1-6-3-4-10(2)7(5-6)8(11)13-9(10)12/h3,7H,4-5H2,1-2H3
charge 0 multiplicity 1
25 atoms
O  2.007203 -1.076571 -0.441032
O  3.08194 0.997836 -0.280799
O  0.392131 -2.764261 -0.285876
C  0.637968 0.78718 0.287669
C  0.037931 -0.542649 0.838302
C  -0.099816 1.214502 -1.032596
C  -1.497894 -0.652724 0.900816
C  0.663543 1.937019 1.309062
C  2.046619 0.346528 -0.134949
C  -2.247799 0.217852 -0.094976
C  0.734322 -1.61414 -0.005653
C  -1.606102 1.067249 -0.940021
C  -3.756898 0.081273 -0.067165
H  0.444111 -0.690868 1.862275
H  0.270732 0.61637 -1.892254
H  0.172881 2.262433 -1.257274
H  -1.845028 -0.396286 1.92232
H  -1.779141 -1.715365 0.750491
H  -0.362234 2.298006 1.498826
H  1.105738 1.616803 2.269907
H  1.265005 2.778901 0.925097
H  -2.195338 1.674247 -1.640698
H  -4.242687 0.756159 -0.792204
H  -4.162718 0.309344 0.93854
H  -4.065067 -0.955938 -0.305005
