program: Gaussian 09
title: 000111957
version: EM64L-G09RevD.01
frameworkgroup: C1[X(C19H15ClN4O4S)]
method: RPBEPBE
basis: SDD
operation: Freq
keyword: #p
keyword: freq=noraman
keyword: PBEPBE/SDD
title: #p freq=noraman PBEPBE/SDD
converged: YES YES NO NO
title: Mulliken charges:
elementType: Cl S O O O O N N N N C C C C C C C C C C C C C C C C C C C H H H H H H H H H H H H H H H
charge: 0.011215 0.990488 -0.567460 -0.501923 -0.497548 -0.250547 -0.089015 -0.102392 -0.119350 -0.103607 -0.027105 -0.278573 0.319090 -0.242719 -0.304982 -0.182215 0.157318 0.166214 -0.268336 -0.320250 -0.269556 -0.326835 0.150479 0.324511 -0.288045 -0.311209 -0.312424 -0.326609 -0.537016 0.327099 0.292147 0.271810 0.283937 0.260993 0.279526 0.257450 0.277741 0.257709 0.246139 0.259874 0.383560 0.228891 0.252551 0.228974
chargesum: 0.00000
title: Mulliken charges with hydrogens summed into heavy atoms:
elementType: Cl S O O O O N N N N C C C C C C C C C C C C C C C C C C C
charge: 0.011215 0.990488 -0.183899 -0.501923 -0.497548 -0.250547 -0.089015 -0.102392 -0.119350 -0.103607 -0.027105 0.048526 0.319090 0.049428 -0.304982 0.089594 0.157318 0.166214 0.015601 -0.059257 0.009970 -0.069385 0.150479 0.324511 -0.010304 -0.053500 -0.066285 -0.066735 0.173400
polarizability: 1.05769211e+03 -2.55148872e+01 3.00435962e+02 3.09231240e+00 4.90582446e+00 1.28925245e+02
1716.lowfreq: -2.0324 -0.0016 -0.0002 0.0014 2.2011 3.5503 9.2230 14.3944 22.5434
frequency: 8.6467 14.3575 22.5420 28.6865 37.2912 51.4338 53.1425 67.9635 85.8276 87.8435 112.5692 131.6547 135.9570 150.8988 164.2322 169.7506 193.1579 196.7129 215.1429 227.9630 233.2437 241.4382 257.1190 278.6572 286.9731 302.7472 342.5189 351.3612 361.2483 384.7035 389.4523 393.9258 423.3471 431.1027 449.6326 461.6733 467.6161 496.7505 516.2668 527.8079 536.3892 555.8368 565.8186 577.1905 604.2963 621.7616 634.7121 637.9747 700.1048 732.6766 740.8124 746.5788 764.4064 812.1862 817.6093 826.2894 830.0586 845.2028 846.7155 849.1367 883.7457 897.9804 898.5478 944.8738 964.7019 968.9535 973.6208 977.9379 980.1504 986.7996 990.0418 990.6315 1014.9154 1023.3193 1045.6893 1057.7918 1100.7330 1105.7995 1111.0881 1120.4243 1132.1971 1147.2695 1156.0957 1161.9894 1181.7636 1214.8552 1228.9069 1241.4246 1260.1969 1286.4137 1291.0911 1309.7716 1345.2084 1357.4607 1375.2514 1389.0235 1405.1164 1432.5517 1435.2465 1440.3707 1443.0186 1465.1312 1469.7490 1470.0121 1485.8657 1544.9562 1558.5008 1564.7352 1591.2181 1600.7817 1612.3949 2971.6066 3064.9745 3135.4221 3152.9418 3154.7150 3154.9865 3156.6948 3157.8347 3164.4250 3172.5975 3175.0821 3177.7379 3179.6132 3182.4509 3481.1026
redmass: 5.1964 5.1029 8.4910 9.1863 4.0161 6.0505 7.4497 9.2991 5.8380 6.1246 4.3125 6.6559 8.5971 9.2901 5.0167 1.8875 2.2799 5.0859 6.9516 7.3258 1.7433 4.6647 7.0318 4.3221 4.5014 7.4551 9.4910 7.8664 5.4781 13.5107 4.0141 6.5186 3.2664 4.0007 5.6264 7.0487 3.5144 7.4716 2.6882 5.6204 7.3214 3.0977 6.0959 6.9243 5.2189 7.1326 7.0937 7.3017 7.0095 3.9529 3.9758 5.7110 4.0141 6.3802 1.2620 1.8917 3.2323 7.9463 1.2901 1.5801 1.6464 8.0404 6.8532 1.4635 1.7608 4.4427 1.3562 8.4527 1.3446 1.3709 2.5825 2.6156 1.3352 5.9874 1.2850 1.6147 1.3697 1.2744 1.2584 2.0682 1.7518 1.2647 1.4182 1.8480 1.9273 2.0953 2.6000 2.3147 4.6042 1.3443 1.3748 5.8491 6.5781 5.2586 5.7221 6.3952 7.3620 2.4451 1.3852 3.5484 3.5317 2.3660 1.0940 1.0789 2.3923 6.6086 7.3663 7.6941 8.7957 6.4260 6.3193 1.0325 1.1046 1.1002 1.0873 1.0916 1.0882 1.0885 1.0875 1.0893 1.0960 1.0967 1.0975 1.0975 1.0976 1.0661
irintensity: 0.3983 1.1742 0.2299 1.4117 0.2051 0.1506 0.9657 0.8485 2.4459 1.0068 1.4825 6.0559 3.0354 0.7432 14.0802 29.3492 2.9621 14.7298 4.5846 0.7325 1.4281 41.3527 11.4104 2.2805 46.9604 6.3574 9.3708 1.2786 0.0847 99.5086 0.1208 2.5738 0.0535 0.1381 7.7506 31.6552 10.4283 56.9938 7.9267 1.6053 82.0880 84.3976 123.8704 16.4811 30.5377 3.5344 2.7729 1.9161 22.9776 0.2118 4.6237 6.3276 0.6911 9.4974 1.4719 73.0529 40.7019 35.5112 0.4892 67.7466 78.1963 12.1768 11.5900 19.9390 26.8258 64.1516 1.3844 103.4571 0.8300 0.0018 7.7436 5.1993 0.0247 83.4534 47.4615 53.2240 25.4968 27.1649 0.3583 417.1837 228.9449 128.6681 11.1257 41.7797 62.4493 12.4636 316.7147 400.7367 134.1315 0.0337 48.8886 838.4757 9.5318 3.3094 11.3417 5.1851 3.4545 60.6520 6.0297 16.2150 33.6319 9.1843 60.8665 43.9742 61.0132 23.7360 3.7565 2.7919 4.7498 312.4113 388.3319 123.1627 39.5592 30.8566 10.4722 10.0809 3.2351 0.6526 0.2975 16.6992 15.6354 6.6954 0.5432 17.8402 1.8053 51.7846
temp: 298.150 k
press: 1.00000 atm
elementType: 17 16 8 8 8 8 7 7 7 7 6 6 6 6 6 6 6 6 6 6 6 6 6 6 6 6 6 6 6 1 1 1 1 1 1 1 1 1 1 1 1 1 1 1
symmnumber: 1
zpe: 802201.5 jmol-1
zpe.correction: 0.305542 hartree
zpe.thermalcorrener: 0.333113 hartree
zpe.thermalcorrenthalpy: 0.334057 hartree
zpe.thermalcorrgfe: 0.242603 hartree
zpe.sumelectzpe: -2108.719564 hartree
zpe.sumelectthermal: -2108.691994 hartree
zpe.sumelectthermalent: -2108.691050 hartree
zpe.sumelectthermalfe: -2108.782503 hartree
dipole: 7.8830 -0.0787 1.3096
dipole: 7.9915
quadrupole: -131.6474 -171.0769 -188.4993
quadrupole: -34.6933 -13.3275 -6.2082
quadrupole: 32.0938 -7.3357 -24.7581 -34.6933 -13.3275 -6.2082
hfenergy: -2109.0251067 hartree
pointgroup: C01 [X(C19H15Cl1N4O4S1)]
dipole: -3.0957059 -0.4060914 -0.3700882 debye
polarizability: 1058.2176428|17.1006419|193.0491065|-0.2850385|-82.7420511|235.7865676 unknown
InChI: InChI=1S/C19H15ClN4O4S/c1-28-16-8-6-15(7-9-16)22-21-13-2-4-14(5-3-13)23-24-19-12-17(29(25,26)27)10-11-18(19)20/h2-12,25H,1H3
charge 0 multiplicity 1
44 atoms
Cl 4.099488 2.540474 -2.906821
S  7.378089 -0.901655 1.44049
O  7.476761 -2.454339 0.421826
O  8.866734 -0.282583 1.58419
O  6.480451 -1.199336 2.752242
O  -9.72111 0.167797 -0.415049
N  2.83986 0.80461 -0.778661
N  2.261419 0.097489 0.163363
N  -3.39193 -0.202416 0.37322
N  -4.097365 0.425044 -0.544603
C  6.398714 0.078998 0.171203
C  5.009314 0.023252 0.224951
C  4.264967 0.783822 -0.724187
C  7.130806 0.837896 -0.761439
C  4.987221 1.555697 -1.678829
C  6.397031 1.591533 -1.699997
C  0.842109 0.094864 0.119834
C  -1.98117 -0.05563 0.223722
C  0.053234 0.780056 -0.859356
C  0.206352 -0.659604 1.145016
C  -1.340163 0.704708 -0.807695
C  -1.194569 -0.733072 1.196194
C  -5.50372 0.292082 -0.412948
C  -8.329469 0.166088 -0.352992
C  -6.167856 -0.445834 0.610708
C  -6.278951 0.964415 -1.403228
C  -7.568778 -0.511012 0.644276
C  -7.677517 0.904686 -1.377499
C  -10.466251 -0.575658 0.610167
H  4.462819 -0.566591 0.968415
H  8.224489 0.849876 -0.743417
H  6.913232 2.200652 -2.446623
H  0.568503 1.353547 -1.635821
H  0.835573 -1.171341 1.879802
H  -1.969421 1.215869 -1.542009
H  -1.710777 -1.305221 1.972973
H  -5.559912 -0.956156 1.363965
H  -5.750344 1.525337 -2.180386
H  -8.064821 -1.080792 1.435532
H  -8.289656 1.412842 -2.12772
H  7.971348 -3.138895 0.960288
H  -10.21904 -1.653562 0.579441
H  -11.524732 -0.428729 0.352951
H  -10.266162 -0.17101 1.620213
