program: Gaussian 09
title: 000111951
version: EM64L-G09RevD.01
frameworkgroup: C1[X(C18H32N2O4Si)]
method: RPBEPBE
basis: SDD
operation: Freq
keyword: #p
keyword: freq=noraman
keyword: PBEPBE/SDD
title: #p freq=noraman PBEPBE/SDD
converged: YES YES NO NO
title: Mulliken charges:
elementType: Si O O O O N N C C C C C C C C C C C C C C C C C C H H H H H H H H H H H H H H H H H H H H H H H H H H H H H H H H
charge: 1.550624 -0.596837 -0.582923 -0.601933 -0.308807 -0.405782 -0.435219 -0.920533 -0.328272 -0.391006 -0.229430 -0.222886 -0.211558 -0.193871 0.305594 0.563764 -0.728025 -0.664264 -0.658776 -0.664334 -0.404676 -0.427402 -0.234684 -0.229141 -0.248958 0.239678 0.262585 0.218269 0.260571 0.198572 0.249569 0.284986 0.259323 0.204395 0.236384 0.190442 0.200597 0.195643 0.210817 0.282927 0.212306 0.230993 0.243040 0.228585 0.215094 0.209108 0.228091 0.228509 0.193665 0.222918 0.221174 0.198817 0.225412 0.234673 0.224764 0.227564 0.229867
chargesum: 0.00000
title: Mulliken charges with hydrogens summed into heavy atoms:
elementType: Si O O O O N N C C C C C C C C C C C C C C C C C C
charge: 1.550624 -0.596837 -0.582923 -0.601933 -0.308807 -0.120796 -0.152292 -0.418270 0.150567 0.057135 0.029894 0.217893 0.179482 0.212589 0.305594 0.563764 -0.041686 -0.011477 -0.008512 -0.021426 -0.179264 -0.192730 -0.009920 -0.001577 -0.019092
polarizability: 2.48784784e+02 -1.22112705e+00 2.49993744e+02 -1.01941989e+01 6.75410439e+00 2.14155251e+02
1716.lowfreq: -10.5416 -2.1600 -0.0007 0.0007 0.0008 4.3354 9.2030 11.6052 14.1409
frequency: -8.5467 9.3946 13.9170 21.8573 22.5233 28.5896 31.2898 35.5272 46.0980 49.5261 59.4734 61.9512 69.0060 72.8273 81.8505 110.2958 128.4698 135.0814 140.9417 176.0562 191.6319 205.6523 218.5737 238.9905 246.4833 247.3489 250.1181 254.5217 258.5991 263.3411 271.1043 282.4488 286.3915 289.6684 322.3287 366.0724 384.5576 400.7345 416.1955 438.1244 463.1945 494.7606 523.9142 559.0257 598.2270 600.3301 617.5009 676.6305 694.2897 702.5369 703.7842 716.1431 743.2709 762.8677 771.1944 778.5324 803.3957 804.0268 810.3317 851.3704 860.4060 886.6498 909.5097 916.3037 931.8910 939.6656 946.5498 964.9418 974.5048 990.0242 993.8475 1007.8715 1025.4440 1030.9119 1050.5360 1055.3925 1066.9898 1074.9202 1077.5945 1096.5694 1101.8868 1102.2310 1103.5423 1108.5435 1130.7080 1136.3662 1137.4936 1152.8185 1168.3646 1171.8273 1185.1565 1200.8101 1226.7283 1240.5862 1260.9356 1264.4660 1271.1063 1277.4625 1284.3164 1287.2861 1308.5801 1350.0600 1357.8315 1360.3685 1362.8485 1363.8162 1370.5239 1385.5598 1387.9520 1388.8325 1389.8387 1394.2961 1431.5677 1437.9662 1444.9844 1452.8013 1455.2774 1457.2515 1457.5287 1469.1369 1472.2525 1475.3164 1476.2210 1476.9344 1477.7576 1484.3440 1489.7498 1493.0744 1496.1183 1497.1625 1595.8009 1612.7124 1622.5940 2935.5691 2954.1620 2957.4202 2977.4429 2979.5620 2986.8893 2987.6082 2988.7322 2989.5365 2992.9572 3003.0303 3009.6486 3016.4818 3020.4936 3035.0528 3054.5639 3072.5983 3075.2011 3083.9485 3086.2885 3088.4412 3097.0114 3097.9003 3100.6372 3102.7188 3115.0094 3117.8213 3131.8307 3142.8014 3161.2949 3546.9053 3560.6643
redmass: 3.4281 4.2305 3.7720 3.3877 3.7457 3.7057 3.0903 3.4652 2.2381 2.6008 4.2740 4.2624 2.2546 3.2691 3.5412 3.6080 3.2780 3.9098 3.3000 3.5578 2.5069 2.5843 2.1532 1.4579 1.2036 1.4352 1.4779 1.4298 2.1930 2.8367 3.6856 2.9912 2.9652 2.6432 4.2374 3.6409 3.8117 2.8123 3.9029 4.2034 1.4004 3.1467 3.3853 3.1810 4.4449 3.9504 6.2126 2.9011 4.2066 4.3434 1.7696 5.3220 1.9652 3.0564 1.9509 3.1852 1.0917 1.0876 1.0899 1.2565 2.1753 2.7127 2.0746 1.4369 2.7180 2.5143 2.5307 2.6393 1.3916 5.3702 1.3347 1.8665 2.0753 1.7567 4.4217 3.8247 3.1366 1.8224 4.7243 2.4011 2.1578 2.1184 2.1523 2.5139 1.4465 1.4717 1.4809 1.4916 2.1262 1.1590 1.1130 1.3908 2.5100 1.6608 1.1277 1.1250 1.1339 1.2975 1.3170 1.3228 1.3460 1.2315 1.5760 1.3062 1.2574 1.2564 1.2214 1.4041 1.2674 1.2594 1.2654 2.4294 1.0940 1.4683 1.8569 1.2189 1.0415 1.0419 1.0415 1.0578 1.0912 1.0537 1.0553 1.2283 1.0457 1.7310 1.0785 1.0903 1.0839 2.1413 6.0170 6.1067 5.1853 1.0561 1.0570 1.0569 1.0372 1.0585 1.0384 1.0991 1.0398 1.0355 1.0609 1.0628 1.1059 1.1070 1.0846 1.0974 1.1035 1.0987 1.1011 1.0985 1.0983 1.0989 1.0992 1.1013 1.1015 1.1013 1.0855 1.0873 1.0910 1.0960 1.1014 1.0778 1.0776
irintensity: 0.3100 0.2315 0.2171 0.1576 0.7755 0.2101 0.5593 0.4301 0.6249 1.2120 15.5912 12.1101 1.2978 2.7692 3.0155 9.2535 5.5101 7.7790 3.3490 1.6686 0.9280 0.3845 2.4553 2.4643 0.2536 3.1647 2.1087 3.6151 1.1532 4.6069 9.6799 18.8908 9.4579 11.1601 5.7799 15.0873 1.1845 1.0211 6.6058 10.0597 269.5090 21.3759 15.6856 18.7039 1.3095 10.9828 0.4834 14.5812 33.8331 43.7765 80.0319 41.4697 32.6927 7.6342 44.5508 49.7029 1.8756 2.4220 2.4728 1.3814 11.8431 11.4594 5.0507 1.4552 93.0063 102.3685 62.2629 70.7871 0.1192 0.0984 0.1989 16.3363 6.4333 16.4146 484.6141 208.5958 34.2416 9.3460 71.3280 24.7805 10.8100 3.6691 8.9715 3.9233 1.9260 6.4070 4.6915 25.4468 3.5661 1.4450 3.5475 84.8413 13.5284 123.3290 0.3085 0.7633 1.4768 3.7326 21.5063 38.6578 13.7115 15.6433 7.6303 1.4561 19.2635 6.9340 1.6606 25.1216 30.6419 24.1670 39.0865 6.1282 7.0904 36.4836 4.2125 74.5074 9.7115 8.8815 7.6640 15.8991 9.2388 5.3676 5.3814 2.9264 2.0481 14.2497 8.8071 5.8946 0.2215 503.2971 3.2509 3.2226 139.4098 59.7982 57.8292 40.4332 28.1941 12.4681 44.9079 31.1414 36.1745 22.2972 24.8545 61.8223 31.0716 16.4583 3.8515 9.0138 14.5802 38.2267 31.1229 39.0411 40.1810 39.2922 22.5669 46.2406 32.2346 38.3965 7.9958 2.7138 9.7013 39.1355 20.2357 9.9672 14.4808
temp: 298.150 k
press: 1.00000 atm
elementType: 14 8 8 8 8 7 7 6 6 6 6 6 6 6 6 6 6 6 6 6 6 6 6 6 6 1 1 1 1 1 1 1 1 1 1 1 1 1 1 1 1 1 1 1 1 1 1 1 1 1 1 1 1 1 1 1 1
symmnumber: 1
zpe: 1259568.0 jmol-1
zpe.correction: 0.479744 hartree
zpe.thermalcorrener: 0.510490 hartree
zpe.thermalcorrenthalpy: 0.511435 hartree
zpe.thermalcorrgfe: 0.411095 hartree
zpe.sumelectzpe: -1403.023864 hartree
zpe.sumelectthermal: -1402.993118 hartree
zpe.sumelectthermalent: -1402.992174 hartree
zpe.sumelectthermalfe: -1403.092513 hartree
dipole: -1.8703 -0.7174 -5.0663
dipole: 5.4479
quadrupole: -147.7120 -146.1837 -158.2824
quadrupole: -0.2308 -1.7718 11.1694
quadrupole: 3.0141 4.5423 -7.5564 -0.2308 -1.7718 11.1694
hfenergy: -1403.5036081 hartree
pointgroup: C01 [X(C18H32N2O4Si1)]
dipole: -0.5617129 -0.4029724 -2.0288224 debye
polarizability: 250.2608088|-2.233318|250.7044836|-6.8498036|4.3364162|211.9684868 unknown
InChI: InChI=1S/C18H32N2O4Si/c1-5-22-25(23-6-2,24-7-3)15-11-14-19-18(21)20-16(4)17-12-9-8-10-13-17/h8-10,12-13,16,19-20H,5-7,11,14-15H2,1-4H3
charge 0 multiplicity 1
57 atoms
Si 2.819581 -0.013631 0.174067
O  1.95407 0.83618 1.387059
O  4.248691 -0.487766 1.017526
O  3.223517 1.006146 -1.164666
O  -1.723174 -2.068554 1.01765
N  -0.716229 -3.021197 -0.869619
N  -2.744502 -1.840065 -1.075509
C  1.866232 -1.467468 -0.574925
C  1.368615 -2.487425 0.477463
C  0.426693 -3.568161 -0.113757
C  -3.807955 -0.957234 -0.561965
C  0.505512 1.120715 1.400213
C  5.486405 -0.940633 0.373855
C  3.820735 2.345338 -1.047326
C  -1.724613 -2.296673 -0.234504
C  -3.375788 0.515347 -0.481864
C  -5.070062 -1.119088 -1.442265
C  0.19715 1.870829 2.695532
C  6.5705 -1.021973 1.449901
C  3.77915 3.005812 -2.425856
C  -2.679359 1.136513 -1.548434
C  -3.712124 1.289795 0.654624
C  -2.332556 2.504453 -1.484073
C  -3.371384 2.660063 0.722786
C  -2.681391 3.273034 -0.348417
H  2.511006 -1.958996 -1.331328
H  1.001338 -1.045491 -1.123827
H  2.227917 -2.999659 0.953352
H  0.81953 -1.972366 1.285441
H  0.984529 -4.228088 -0.804725
H  0.040133 -4.190595 0.714507
H  -0.684902 -3.059857 -1.888311
H  -4.037343 -1.297501 0.464962
H  0.232129 1.736574 0.518605
H  -0.071221 0.175076 1.353855
H  5.326532 -1.937375 -0.0916
H  5.781013 -0.235597 -0.432087
H  4.866596 2.25429 -0.686593
H  3.256255 2.941265 -0.301609
H  -2.797488 -2.149216 -2.046639
H  -4.870832 -0.809915 -2.4866
H  -5.416908 -2.168318 -1.439769
H  -5.884255 -0.480305 -1.06071
H  0.469228 1.253165 3.568468
H  0.77184 2.812312 2.743535
H  -0.882173 2.10604 2.746462
H  6.733716 -0.029462 1.903706
H  6.261251 -1.717297 2.249065
H  7.524374 -1.378771 1.017147
H  4.333257 2.395866 -3.160472
H  2.736075 3.102158 -2.774127
H  4.234588 4.013449 -2.388111
H  -2.392288 0.545084 -2.426711
H  -4.228638 0.813006 1.497057
H  -1.790713 2.971076 -2.314888
H  -3.635579 3.24521 1.611115
H  -2.411781 4.333879 -0.296264
