program: Gaussian 09
title: 000111945
version: EM64L-G09RevD.01
frameworkgroup: C1[X(C21H16O6S2)]
method: RPBEPBE
basis: SDD
operation: Freq
keyword: #p
keyword: freq=noraman
keyword: PBEPBE/SDD
title: #p freq=noraman PBEPBE/SDD
converged: YES YES NO NO
title: Mulliken charges:
elementType: S S O O O O O O C C C C C C C C C C C C C C C C C C C C C H H H H H H H H H H H H H H H H
charge: 0.948540 0.984549 -0.558929 -0.497956 -0.513667 -0.568485 -0.505626 -0.503842 -0.763970 0.679355 0.540903 -0.377168 -0.582267 0.398700 0.389628 0.417666 -0.589878 0.393483 -0.455122 -0.432849 -0.428603 -0.399343 -0.405771 -0.079563 -0.419552 -0.402693 -0.245599 -0.228290 -0.233435 0.271338 0.238703 0.250662 0.310956 0.302550 0.234579 0.247206 0.290590 0.263887 0.249736 0.254010 0.283078 0.237554 0.239410 0.384207 0.381320
chargesum: 0.00000
title: Mulliken charges with hydrogens summed into heavy atoms:
elementType: S S O O O O O O C C C C C C C C C C C C C C C C C C C C C
charge: 0.948540 0.984549 -0.174722 -0.497956 -0.513667 -0.187164 -0.505626 -0.503842 -0.253929 0.679355 0.540903 -0.377168 -0.331605 0.398700 0.389628 0.417666 -0.278922 0.393483 -0.152573 -0.198270 -0.181398 -0.108752 -0.141884 -0.079563 -0.169816 -0.148683 0.037479 0.009264 0.005975
polarizability: 4.13723330e+02 -2.26225887e+01 3.17741472e+02 3.92844779e+00 1.74652573e+01 2.43263396e+02
1716.lowfreq: -4.4548 -3.4108 -0.0001 0.0011 0.0011 3.5073 13.0907 16.7805 27.5718
frequency: 12.8389 16.7552 27.5457 35.7918 47.0579 54.5079 70.2325 94.1930 99.3155 122.7593 135.6439 158.2432 161.0164 166.6145 177.9593 189.4651 207.4348 209.5957 221.0506 248.4549 258.9279 268.6240 288.0802 302.9310 312.4236 318.5193 339.4370 349.9903 362.5987 399.8746 402.5312 408.7985 423.8227 435.1296 468.0160 479.1271 482.3291 483.9384 507.9464 519.1296 526.4029 544.2864 560.4158 580.0819 583.3973 622.7017 633.8144 665.2909 677.8176 731.0450 745.3116 765.6703 780.5252 781.9180 785.0570 793.2488 828.7823 832.3028 834.9585 835.7527 866.5096 871.9963 887.8689 916.9433 923.8446 931.2243 940.0076 944.9963 956.3212 963.5517 965.5384 969.8008 976.6710 979.5092 990.4429 1000.7917 1022.5012 1047.5009 1048.8514 1057.2438 1128.1763 1138.1159 1144.9864 1163.9136 1177.7039 1184.1855 1187.3818 1225.6730 1232.7721 1253.0842 1262.2198 1276.7715 1277.3236 1310.4328 1334.4824 1341.4104 1400.2858 1407.2897 1417.1736 1422.5368 1430.4937 1434.3970 1447.4672 1455.0547 1478.7154 1502.6876 1513.5017 1572.1671 1575.1654 1594.3479 1598.3136 1632.4415 1635.1928 3014.2163 3089.7574 3120.8095 3125.7734 3128.2717 3130.2291 3136.1185 3142.0763 3144.9893 3146.5534 3147.9090 3151.3166 3169.3037 3173.0222 3476.7414 3481.3406
redmass: 7.7280 7.8316 7.6535 5.0082 9.7827 6.5694 5.5241 8.9412 6.5548 7.0419 8.1837 2.0929 5.5638 1.8136 3.3065 3.4305 7.3439 3.6519 6.7372 3.5515 4.1811 4.1428 6.5463 5.0659 5.9332 8.0302 6.8701 3.7215 6.4812 3.8089 5.2221 7.0980 4.8668 3.9995 5.4722 2.9286 4.2250 2.7032 6.0545 5.8176 6.6157 6.2150 6.6773 8.4434 4.4118 6.4152 7.0113 4.3299 5.3146 5.2144 3.6110 1.2832 3.7906 3.4692 2.9375 2.8887 3.2085 5.9834 2.3175 1.7089 1.4191 3.7157 3.5706 1.5260 1.5602 2.0352 2.4952 3.2652 2.0969 7.6662 4.2046 3.5072 1.4337 1.4127 1.4349 1.3540 2.2732 1.3552 1.1699 1.8312 1.7641 1.5961 1.6703 1.3079 1.0782 1.3774 1.4172 1.8048 1.5568 2.0908 1.8786 1.8567 1.8824 1.6898 1.6351 1.6378 4.1657 3.9571 4.9323 2.3494 4.7414 7.2254 2.6196 2.4156 1.1078 3.6472 3.9488 6.6394 6.5979 6.4425 6.6989 6.6433 6.6429 1.0652 1.0962 1.0872 1.0933 1.0901 1.0877 1.0892 1.0920 1.0898 1.0966 1.0930 1.0955 1.1005 1.0968 1.0662 1.0661
irintensity: 0.8060 0.3877 1.1689 0.6635 0.2100 0.9798 0.0444 0.7962 0.5645 0.3914 2.3642 41.8841 3.1012 37.7591 26.2963 6.5034 11.6055 13.9309 13.2229 21.5674 20.0757 26.8056 7.1525 34.3585 12.5797 31.6926 7.1158 4.7353 5.8005 13.7200 35.3865 78.3697 33.2582 4.0286 13.0548 14.4152 46.1390 11.3585 13.4703 21.9177 1.0789 93.4425 139.2645 60.2835 11.3087 6.6509 17.0229 13.4262 2.2097 10.1218 1.4604 64.2934 2.4334 2.8757 1.6861 9.3399 80.0808 78.8604 33.1509 14.8859 3.3842 1.7783 7.3481 44.2520 34.0500 7.3087 6.3149 31.6539 51.8794 63.8126 59.6989 30.0745 11.4028 1.2958 8.5394 0.0209 2.9340 43.4733 74.4323 81.9012 5.2059 14.1818 5.1244 5.2697 1.3823 9.8381 0.6989 7.0366 4.9675 0.7081 1.7348 18.6420 2.5056 5.1464 0.7147 8.8046 7.5974 12.3919 13.8371 4.2838 0.6680 2.5849 3.3269 3.9580 11.6659 18.3741 20.9390 6.8252 2.6045 22.7994 1.3037 26.1534 24.5013 13.2107 2.3420 10.3331 5.0536 1.4267 5.3594 0.2893 8.0731 2.3692 17.5778 2.7740 19.0635 29.4358 4.3761 53.8324 41.4327
temp: 298.150 k
press: 1.00000 atm
elementType: 16 16 8 8 8 8 8 8 6 6 6 6 6 6 6 6 6 6 6 6 6 6 6 6 6 6 6 6 6 1 1 1 1 1 1 1 1 1 1 1 1 1 1 1 1
symmnumber: 1
zpe: 834837.0 jmol-1
zpe.correction: 0.317973 hartree
zpe.thermalcorrener: 0.344933 hartree
zpe.thermalcorrenthalpy: 0.345877 hartree
zpe.thermalcorrgfe: 0.258218 hartree
zpe.sumelectzpe: -2054.937334 hartree
zpe.sumelectthermal: -2054.910374 hartree
zpe.sumelectthermalent: -2054.909430 hartree
zpe.sumelectthermalfe: -2054.997089 hartree
dipole: -6.9567 4.2247 1.9145
dipole: 8.3612
quadrupole: -216.9660 -169.9970 -177.1317
quadrupole: -8.4777 -5.2169 -6.3455
quadrupole: -28.9344 18.0345 10.8999 -8.4777 -5.2169 -6.3455
hfenergy: -2055.2553071 hartree
pointgroup: C01 [X(C21H16O6S2)]
dipole: -2.7531544 1.2446344 1.3008173 debye
polarizability: 414.1590856|-21.5377142|295.3861708|-4.466021|38.0647347|265.1829417 unknown
InChI: InChI=1S/C21H16O6S2/c22-28(23,24)20-8-7-17-9-14(5-6-18(17)12-20)10-19-11-15-3-1-2-4-16(15)13-21(19)29(25,26)27/h1-9,11-13,22,25H,10H2
charge 0 multiplicity 1
45 atoms
S  -3.071854 -2.298582 -1.494952
S  6.563846 0.570868 -0.399691
O  -3.764685 -3.453951 -0.212595
O  -4.097771 -2.196102 -2.739908
O  -1.542728 -2.752839 -1.784653
O  6.199986 2.280893 -1.038829
O  7.207961 0.697665 1.079443
O  7.339497 -0.242633 -1.564555
C  -1.403917 -1.591061 1.272749
C  -2.379662 -0.550521 0.712315
C  0.057441 -1.148962 1.177151
C  -3.187771 -0.731421 -0.454634
C  -2.539608 0.683219 1.360695
C  -3.44342 1.694398 0.904044
C  2.123665 -0.830502 -0.130486
C  -4.242021 1.448674 -0.27926
C  0.763757 -1.262909 -0.027239
C  2.779614 -0.272959 1.037393
C  -4.094064 0.19792 -0.95219
C  0.719898 -0.604275 2.328858
C  2.046457 -0.176502 2.264055
C  4.140677 0.161836 0.935586
C  2.855878 -0.946455 -1.360749
C  4.78019 0.023002 -0.286884
C  -3.586228 2.949221 1.583581
C  -5.153478 2.454248 -0.741614
C  4.18116 -0.521858 -1.455115
C  -4.480068 3.91297 1.112292
C  -5.269796 3.664966 -0.057414
H  -1.535418 -2.55795 0.761722
H  -1.66451 -1.758176 2.334296
H  -1.944396 0.880766 2.260442
H  0.26774 -1.698548 -0.903073
H  -4.681689 -0.027438 -1.849222
H  0.172998 -0.540579 3.277626
H  2.543235 0.230715 3.151958
H  4.666535 0.578869 1.801441
H  2.356323 -1.375561 -2.236043
H  -2.982412 3.143386 2.477438
H  -5.753996 2.259606 -1.637341
H  4.757293 -0.61343 -2.380163
H  -4.582335 4.869221 1.636244
H  -5.965043 4.433068 -0.411691
H  -3.767083 -4.373877 -0.608988
H  7.078802 2.713478 -1.248139
