program: Gaussian 09
title: 000111917
version: EM64L-G09RevD.01
frameworkgroup: C1[X(C19H21ClN6O7)]
method: RPBEPBE
basis: SDD
operation: Freq
keyword: #p
keyword: freq=noraman
keyword: PBEPBE/SDD
title: #p freq=noraman PBEPBE/SDD
converged: YES YES NO NO
title: Mulliken charges:
elementType: Cl O O O O O O O N N N N N N C C C C C C C C C C C C C C C C C C C H H H H H H H H H H H H H H H H H H H H H
charge: -0.012964 -0.294663 -0.322299 -0.262415 -0.204530 -0.175332 -0.205362 -0.212904 -0.397362 -0.426200 -0.094631 -0.094663 0.013111 0.013208 0.387290 0.186406 0.353507 -0.493054 -0.058583 -0.401315 -0.338352 -0.314611 -0.716214 -0.236065 0.226655 0.211770 0.315596 -0.180915 -0.538356 0.463259 -0.413832 -0.777615 -0.490765 0.334148 0.295465 0.399306 0.233196 0.237244 0.232341 0.228413 0.355091 0.218450 0.229373 0.230630 0.222248 0.205213 0.334051 0.314539 0.258334 0.257387 0.229751 0.222540 0.236557 0.217924
chargesum: 0.00000
title: Mulliken charges with hydrogens summed into heavy atoms:
elementType: Cl O O O O O O O N N N N N N C C C C C C C C C C C C C C C C C C C
charge: -0.012964 -0.294663 -0.322299 -0.262415 -0.204530 -0.175332 -0.205362 -0.212904 0.001944 -0.071109 -0.094631 -0.094663 0.013111 0.013208 0.387290 0.186406 0.353507 -0.158906 -0.058583 -0.105851 0.132089 0.146143 -0.037761 0.191396 0.226655 0.211770 0.315596 -0.180915 -0.204305 0.463259 -0.099293 -0.032144 0.186256
polarizability: 8.13415494e+02 5.99472914e+01 3.42028865e+02 2.09364429e+01 -2.31857810e+01 1.88203477e+02
1716.lowfreq: -5.6347 -0.0009 -0.0005 0.0011 2.3187 2.7628 10.0931 16.7339 21.8937
frequency: 9.9743 16.7244 21.8511 24.1382 30.4839 34.1236 51.2377 53.8496 61.0285 66.8117 70.0560 80.4321 88.2782 104.3397 107.4828 116.6143 116.8441 119.6789 142.9594 154.3384 159.9477 168.9695 185.4291 199.1196 205.3803 219.4609 234.9386 246.3434 251.7922 273.7634 278.6558 295.5297 309.9608 321.1564 326.2011 331.3026 335.5260 349.3888 352.5488 382.3831 402.1552 456.9819 466.0476 473.8656 495.5178 506.4851 518.1468 529.6266 537.7262 554.0600 591.5215 604.5940 623.5888 644.3853 664.5947 673.7128 692.1201 700.6757 708.1371 726.0568 747.9817 754.5942 758.9393 785.4356 792.6102 809.1766 812.3772 824.1762 835.2238 841.7751 891.6735 906.7827 909.7331 918.6676 924.8910 929.3779 939.3203 954.1549 983.5028 998.4385 1008.3498 1042.6531 1053.7389 1059.5846 1076.9835 1097.6882 1115.2139 1122.3903 1127.6669 1133.1435 1140.2396 1154.4956 1164.8064 1168.9005 1189.1369 1197.1200 1205.1641 1212.2335 1228.9264 1236.7965 1249.0250 1276.5034 1277.5634 1323.4172 1336.8012 1353.9631 1356.0502 1364.5713 1367.7598 1370.3454 1382.7184 1390.4497 1393.0453 1400.0079 1415.9493 1436.1932 1441.1527 1449.9746 1459.2562 1459.3172 1461.8173 1465.0516 1468.5003 1475.0747 1478.1753 1484.1984 1487.5233 1495.9780 1522.2174 1543.8415 1550.7060 1574.6180 1588.8675 1613.6053 1629.5247 2948.2559 2955.5429 2962.7697 2987.7807 2989.1808 2998.4282 3006.1262 3016.2275 3032.8329 3056.1767 3085.6310 3093.2702 3098.3660 3110.5584 3114.8935 3174.6266 3184.0974 3195.0979 3199.6247 3266.8159 3401.0424
redmass: 9.8651 6.4479 3.3741 1.4635 3.3216 5.0810 7.7117 9.0070 15.7041 3.3164 5.0572 4.5519 4.0341 2.8555 3.9720 5.9381 5.3599 3.6585 4.7917 4.7443 3.0375 5.0034 6.6648 5.4218 1.9117 5.6981 4.0189 2.3464 2.6282 2.8425 2.0871 3.4178 10.3908 7.0362 6.7370 4.1704 6.6922 6.2150 12.8575 6.6024 9.0309 4.7397 4.8721 3.5123 5.2036 5.4544 7.7140 5.0037 4.3619 5.3809 3.5679 5.7641 5.1477 5.9789 9.0747 10.0017 11.2877 6.0855 7.8195 5.5908 3.0070 7.5338 4.5284 9.6232 2.3402 1.2456 1.1327 5.5950 1.1933 5.3979 9.8548 1.4808 2.1838 1.4685 1.4415 3.1671 3.3225 1.4471 2.4801 1.7985 2.4762 1.6456 2.2063 3.1121 3.0207 2.2012 2.0230 2.2745 2.3601 3.4612 1.4995 1.9999 2.2513 1.8283 6.8725 3.6515 1.2249 5.4737 1.6375 2.1426 1.2087 1.8664 1.2652 2.5424 3.9511 8.0633 1.3148 6.5359 2.7715 3.0480 1.4621 1.3323 3.2404 1.2698 6.1223 1.1500 6.3058 1.1249 1.1322 1.4394 1.0946 1.3549 1.2076 1.0447 1.0553 1.0698 1.8780 1.5084 4.2613 3.4300 8.9954 1.9924 7.8628 5.0667 6.7639 1.0370 1.0522 1.0588 1.0597 1.0362 1.0363 1.1032 1.1034 1.1043 1.1079 1.1008 1.0983 1.0993 1.1004 1.0989 1.0922 1.0928 1.0927 1.0922 1.0835 1.0767
irintensity: 0.3973 0.0370 0.2315 1.1996 0.4050 0.5255 0.1239 1.4128 0.1040 3.9494 4.3574 4.2952 6.0887 4.0461 3.0199 7.2033 5.5082 0.8085 14.2369 0.3533 2.1556 8.6647 1.0200 1.2794 1.6279 1.7626 5.9654 1.1010 6.0274 1.0738 0.8517 7.6878 1.3182 5.7202 1.9765 6.3297 10.9442 5.2211 5.9838 2.7537 20.6307 0.1646 6.3332 2.6828 15.1524 5.7294 18.7487 3.0770 12.2618 53.8027 5.7911 11.1045 3.5599 20.8818 2.3088 26.9549 52.3314 17.5938 0.7214 14.9940 8.8356 42.9140 3.1805 22.4632 14.2360 77.3322 1.8748 11.5758 61.7848 107.3816 46.5423 11.3640 10.7048 31.5758 28.0221 7.3469 35.1864 21.0294 42.7589 30.1298 103.8690 15.3677 79.9922 58.0932 23.0777 53.4549 52.7918 51.9959 35.7868 114.4202 5.8249 33.7177 53.6572 14.9503 262.7340 1092.2160 37.2148 949.0311 1.2802 95.4474 3.8314 68.5413 31.3865 479.7467 30.9227 99.2648 75.4048 92.6122 200.6054 143.7238 8.2162 175.7983 612.3054 0.7383 337.3179 0.5247 54.0520 98.6025 72.4957 229.2352 45.1585 129.2818 14.4049 7.6952 5.1240 39.2414 136.0431 144.1727 132.5554 316.5984 14.2054 277.2086 262.0440 66.9492 480.7749 72.5612 111.6293 36.8493 29.8039 41.2596 4.7655 16.2680 64.7234 46.2956 24.7098 36.6933 8.3195 37.1475 11.0758 17.8779 5.2190 10.4845 24.9055 9.7835 1272.0123 71.5606
temp: 298.150 k
press: 1.00000 atm
elementType: 17 8 8 8 8 8 8 8 7 7 7 7 7 7 6 6 6 6 6 6 6 6 6 6 6 6 6 6 6 6 6 6 6 1 1 1 1 1 1 1 1 1 1 1 1 1 1 1 1 1 1 1 1 1
symmnumber: 1
zpe: 1039221.2 jmol-1
zpe.correction: 0.395818 hartree
zpe.thermalcorrener: 0.429284 hartree
zpe.thermalcorrenthalpy: 0.430228 hartree
zpe.thermalcorrgfe: 0.325122 hartree
zpe.sumelectzpe: -2049.115208 hartree
zpe.sumelectthermal: -2049.081743 hartree
zpe.sumelectthermalent: -2049.080798 hartree
zpe.sumelectthermalfe: -2049.185904 hartree
dipole: 13.8604 0.3814 -3.0949
dipole: 14.2068
quadrupole: -201.3096 -196.1269 -203.4159
quadrupole: -42.2472 -9.8946 16.3793
quadrupole: -1.0255 4.1572 -3.1317 -42.2472 -9.8946 16.3793
hfenergy: -2049.5110269 hartree
pointgroup: C01 [X(C19H21Cl1N6O7)]
dipole: -5.4147628 -0.0202009 -1.3861069 debye
polarizability: 813.8314391|60.2773561|335.5781993|3.5402277|40.2097119|194.2381964 unknown
InChI: InChI=1S/C19H21ClN6O7/c1-4-21-16-9-14(22-11(2)27)15(10-18(16)33-6-5-32-3)23-24-19-13(20)7-12(25(28)29)8-17(19)26(30)31/h7-10,21-22H,4-6H2,1-3H3
charge 0 multiplicity 1
54 atoms
Cl 2.788441 -1.788923 -1.719291
O  -3.27433 2.094644 0.026425
O  -6.076142 2.304459 -0.707844
O  -2.330574 -4.504484 0.052938
O  3.741998 3.19316 2.27247
O  2.064804 1.669903 2.564248
O  7.865359 1.530327 0.279803
O  7.764367 -0.152892 -1.266672
N  -4.771772 -0.254796 -0.084005
N  -0.624271 -2.898757 0.165742
N  0.803145 -0.679603 0.266865
N  1.564642 0.392274 0.322227
N  3.145222 2.079193 1.988521
N  7.218428 0.641335 -0.401363
C  -3.409373 -0.363813 -0.032155
C  -2.602702 0.849346 -0.009087
C  -1.35536 -1.699287 0.112509
C  -2.754335 -1.632699 0.016584
C  -0.563028 -0.48326 0.155202
C  -1.224403 0.784862 0.088787
C  -5.671276 -1.422231 -0.098278
C  -3.753369 2.622715 -1.279087
C  -7.143251 -0.983161 -0.123126
C  -5.070488 3.333518 -1.012988
C  2.942876 0.280735 0.221856
C  -1.100129 -4.211228 0.13907
C  3.758887 1.223608 0.949901
C  3.663235 -0.554379 -0.705505
C  5.13822 1.368323 0.749466
C  5.767669 0.525054 -0.182905
C  5.038153 -0.442484 -0.915264
C  -0.015901 -5.278418 0.236024
C  -7.336332 2.873583 -0.2213
H  -3.316363 -2.566061 -0.009632
H  -0.62686 1.698631 0.151772
H  -5.203083 0.68861 -0.128681
H  -5.448952 -2.053379 -0.983014
H  -5.476744 -2.048977 0.795426
H  -3.890703 1.800212 -2.007267
H  -3.003222 3.335134 -1.672347
H  0.391135 -2.731289 0.229852
H  -7.399269 -0.400988 0.780908
H  -7.358205 -0.36483 -1.012968
H  -7.798796 -1.870082 -0.15281
H  -4.954385 4.021249 -0.149619
H  -5.382714 3.918004 -1.904737
H  5.709106 2.10864 1.314467
H  5.563376 -1.082981 -1.628198
H  -0.191208 -6.038896 -0.542844
H  -0.095159 -5.78722 1.213403
H  1.006469 -4.878386 0.128102
H  -7.179099 3.44999 0.712717
H  -8.006211 2.023067 -0.022786
H  -7.794719 3.532124 -0.98631
