program: Gaussian 09
title: 000003937
version: EM64L-G09RevD.01
frameworkgroup: C1[X(C21H31N3O5)]
method: RPBEPBE
basis: SDD
operation: Freq
keyword: #p
keyword: freq=noraman
keyword: PBEPBE/SDD
title: #p freq=noraman PBEPBE/SDD
converged: YES YES NO NO
title: Mulliken charges:
elementType: O O O O O N N N C C C C C C C C C C C C C C C C C C C C C H H H H H H H H H H H H H H H H H H H H H H H H H H H H H H H
charge: -0.282574 -0.411037 -0.227136 -0.436683 -0.225829 -0.155288 -0.376510 -0.571116 -0.135067 -0.476498 -0.370295 -0.474917 -0.173055 0.162214 -0.459461 -0.071236 -0.347777 0.188120 -0.489027 -0.358037 -0.574009 0.185470 -0.397643 0.493733 -0.415411 -0.406241 -0.228840 -0.229962 -0.244118 0.310794 0.248425 0.239314 0.240028 0.242887 0.234743 0.246136 0.261986 0.222592 0.216649 0.283572 0.224659 0.231623 0.172806 0.232512 0.248070 0.178131 0.223043 0.233276 0.201203 0.211331 0.174787 0.379978 0.257973 0.271816 0.233011 0.244220 0.372694 0.221974 0.222426 0.225571
chargesum: 0.00000
title: Mulliken charges with hydrogens summed into heavy atoms:
elementType: O O O O O N N N C C C C C C C C C C C C C C C C C C C C C
charge: -0.282574 -0.031059 -0.227136 -0.063989 -0.225829 -0.155288 -0.092938 -0.041327 0.175727 0.011241 0.112620 0.005963 0.088931 0.162214 -0.020220 0.153422 0.056652 0.188120 -0.008445 0.043137 -0.139530 0.185470 -0.011525 0.493733 -0.182400 -0.162021 -0.006866 -0.007536 -0.018547
polarizability: 2.92265294e+02 1.06980973e+01 2.64864863e+02 -2.32144908e+01 1.63823932e+01 2.18656939e+02
1716.lowfreq: -8.1558 -5.1941 -0.0004 0.0004 0.0005 1.9514 12.4004 14.2793 18.1821
frequency: 10.7040 14.0560 17.8714 21.9443 25.4544 27.0749 37.1273 43.6737 46.8953 53.6503 59.7451 67.5515 83.3873 95.3951 104.1158 115.4123 127.2618 132.3559 137.0577 153.2130 158.6889 191.3639 206.1527 236.1958 240.8781 254.3325 260.6223 273.3294 300.0072 322.6254 331.1900 337.6444 358.0753 383.1300 402.8560 413.3715 443.8819 468.4358 479.2592 516.6194 539.2012 554.6772 560.7367 587.6193 594.6413 598.3402 612.8933 618.2452 627.5542 646.3997 698.0488 705.0008 705.9627 715.7790 741.5853 746.5705 761.3642 767.8773 786.1183 802.0020 815.5245 838.3472 852.1047 856.4495 867.0460 884.1267 905.9357 917.7094 918.7723 947.9254 960.3799 976.8078 981.6792 989.7145 993.3080 995.8641 1015.1344 1021.7068 1025.9297 1030.0143 1035.4065 1045.3700 1061.8548 1064.1922 1070.9074 1075.1549 1094.9417 1098.2663 1104.9142 1117.4980 1121.1552 1147.7914 1160.9312 1165.7188 1171.5555 1186.4741 1187.3205 1188.4593 1200.2530 1220.1089 1233.2307 1243.7542 1247.2491 1250.5580 1251.9862 1260.8453 1267.8447 1277.0455 1280.8510 1288.9362 1291.8783 1301.5616 1311.7609 1322.4275 1322.7169 1328.9823 1329.9186 1332.3258 1349.2142 1349.5699 1355.3913 1360.5523 1383.5089 1386.4127 1388.1293 1441.8950 1457.4144 1460.6813 1465.2142 1468.2097 1473.0596 1478.6392 1482.1067 1484.8323 1485.1333 1491.2567 1493.2571 1573.1543 1593.7346 1615.1315 1637.2653 1665.0581 1670.8110 2856.4487 2914.7487 2954.2969 2956.2789 2974.3768 2981.6496 2983.9047 2995.7975 3008.7672 3014.4728 3020.8584 3022.7603 3027.6673 3038.2394 3040.0292 3052.4780 3054.5325 3068.3461 3069.1582 3088.5266 3101.5679 3113.7805 3116.7436 3130.8733 3142.4217 3160.8453 3431.9861 3452.5468 3496.6101 3516.4431 3580.8695
redmass: 5.9648 4.9448 4.4904 5.4265 5.2468 5.0774 4.5181 2.9364 2.4611 6.6752 5.8684 6.6894 5.0032 3.4071 3.3670 4.0920 4.2861 2.4657 2.9891 3.5620 3.2971 3.5552 3.2321 1.5361 2.3353 2.7192 2.8922 3.1246 3.9035 5.3052 3.3960 2.5054 4.1700 5.4628 2.8257 4.6581 3.6394 3.6959 3.5607 3.7194 2.5899 2.3741 4.0242 1.9533 1.3333 1.6250 2.6888 6.2527 1.9986 1.7039 4.4856 4.9947 1.8126 3.3521 1.1367 2.7815 1.9761 2.2706 1.2460 2.9785 2.8386 2.8150 2.3419 1.4734 2.0768 1.3963 1.5933 2.5213 1.4636 3.2656 2.2416 1.3858 1.9725 6.0220 1.3499 2.1944 1.8444 3.2406 2.7339 2.6493 3.2076 2.6608 1.8040 2.5098 1.7599 2.1607 2.5596 1.8562 1.8226 1.9122 3.4287 1.5410 1.4455 1.5524 1.0588 2.3066 1.1300 2.0396 1.3860 2.4476 1.2599 1.5225 1.2833 1.5654 1.3894 1.5832 1.3179 1.2166 1.1415 1.2680 1.1778 1.3208 1.2868 1.3354 1.3359 1.3892 1.3183 1.3866 1.4767 1.8676 1.6082 1.6391 7.5199 1.6063 2.5076 2.1750 1.1111 1.0876 1.0711 1.0851 1.0913 1.1266 1.3333 1.1396 1.6984 1.1036 1.1014 7.8558 6.0467 6.1735 1.0945 8.6673 8.3198 1.0717 1.0818 1.0638 1.0664 1.0602 1.0629 1.0596 1.0611 1.0848 1.0929 1.0629 1.0647 1.0937 1.0914 1.0987 1.1006 1.0993 1.1040 1.0859 1.1020 1.1051 1.0865 1.0869 1.0912 1.0960 1.1015 1.0735 1.0447 1.0637 1.0641 1.0976
irintensity: 0.2415 0.1299 0.4648 1.1365 0.3599 0.2771 0.1675 5.8682 0.4044 0.8047 0.4309 0.8878 2.0274 1.7813 2.8397 1.1181 0.8541 0.0849 2.0457 2.8192 0.0957 1.8916 0.8739 32.6330 10.6624 19.6768 13.5950 5.4755 12.9239 1.0191 3.8765 2.0945 5.5140 20.6411 0.0022 5.8631 36.1206 34.4150 2.1920 23.5962 7.5523 32.3290 13.0173 72.3127 213.8447 19.6997 9.3622 0.0439 79.0824 152.3797 23.8859 12.9501 52.2799 32.1539 19.4262 8.5635 45.4998 8.9487 1.1919 15.8503 0.9384 12.9680 2.5611 1.9350 3.1179 1.6866 7.5609 8.4496 3.6462 5.0422 1.0046 0.0196 2.4623 0.0051 0.8814 9.1700 11.8301 144.0640 50.6429 18.5521 8.4119 292.8963 20.3290 7.4027 35.9212 1.5020 2.1709 7.7495 26.6038 43.4027 34.3063 8.2789 14.0474 2.5032 0.3699 12.5812 0.1846 26.0465 9.5788 0.0648 7.2074 7.4628 2.6082 23.8213 4.6200 11.2304 3.9307 2.1482 3.1515 2.6946 2.6532 3.4740 15.4403 7.0388 13.6002 2.2560 4.8592 5.1976 4.4462 82.1685 25.6591 37.6187 0.2197 42.9807 75.2712 6.5245 11.0399 8.4846 1.1387 9.3093 14.0760 11.2802 18.7632 7.4713 14.9660 4.9894 8.2204 223.5909 1.8011 12.3235 41.6852 169.8794 216.3553 112.2013 37.9761 15.2596 33.6331 27.0474 37.0311 16.7531 26.8936 31.9123 5.1958 21.4315 24.8909 5.1029 1.1019 4.3620 47.9849 84.0004 22.4062 5.0774 20.2497 30.7508 9.5251 3.1531 13.5371 43.7634 26.9941 3.2153 2.1067 15.0151 29.1202 0.1769
temp: 298.150 k
press: 1.00000 atm
elementType: 8 8 8 8 8 7 7 7 6 6 6 6 6 6 6 6 6 6 6 6 6 6 6 6 6 6 6 6 6 1 1 1 1 1 1 1 1 1 1 1 1 1 1 1 1 1 1 1 1 1 1 1 1 1 1 1 1 1 1 1
symmnumber: 1
zpe: 1310853.0 jmol-1
zpe.correction: 0.499278 hartree
zpe.thermalcorrener: 0.530489 hartree
zpe.thermalcorrenthalpy: 0.531434 hartree
zpe.thermalcorrgfe: 0.429176 hartree
zpe.sumelectzpe: -1356.996391 hartree
zpe.sumelectthermal: -1356.965179 hartree
zpe.sumelectthermalent: -1356.964235 hartree
zpe.sumelectthermalfe: -1357.066492 hartree
dipole: -4.3762 -2.1355 4.0084
dipole: 6.3070
quadrupole: -162.3931 -160.9400 -168.6004
quadrupole: 2.2456 -15.6521 4.6479
quadrupole: 1.5847 3.0378 -4.6226 2.2456 -15.6521 4.6479
hfenergy: -1357.4956685 hartree
pointgroup: C01 [X(C21H31N3O5)]
dipole: 1.7241762 -0.8226651 -1.5835419 debye
polarizability: 292.2891344|-10.5099046|264.3888937|-23.3709074|-16.8852073|219.109068 unknown
InChI: InChI=1S/C21H31N3O5/c22-13-5-4-9-16(19(25)24-14-6-10-18(24)21(28)29)23-17(20(26)27)12-11-15-7-2-1-3-8-15/h1-3,7-8,16-18,23,26,28H,4-6,9-14,22H2
charge 0 multiplicity 1
60 atoms
O  0.807148 -1.406351 1.133591
O  3.440011 -4.289831 1.748863
O  4.311436 -2.143534 1.548158
O  -0.241406 1.040209 -2.971033
O  -2.157526 2.164841 -2.30982
N  2.400259 -1.613399 -0.53254
N  -0.116891 1.042414 0.039926
N  4.17406 6.072405 1.452895
C  2.698509 -3.005334 -0.146867
C  3.483051 -3.553452 -1.37439
C  3.223507 -1.145318 -1.682335
C  4.230002 -2.30234 -1.904656
C  1.268799 0.607259 -0.212708
C  1.466506 -0.883322 0.17464
C  2.257408 1.473853 0.617314
C  -1.167808 0.420949 -0.812911
C  2.319852 2.940058 0.13941
C  3.558826 -3.04441 1.123605
C  -2.50719 0.353135 -0.053082
C  3.21306 3.81754 1.043228
C  -3.621924 -0.388567 -0.839338
C  -1.292051 1.299232 -2.065932
C  3.315207 5.27601 0.552231
C  -4.931571 -0.426411 -0.064577
C  -5.249623 -1.519774 0.781258
C  -5.845451 0.656785 -0.142796
C  -6.448491 -1.533594 1.530159
C  -7.045426 0.647281 0.60299
C  -7.351469 -0.448836 1.443343
H  1.772424 -3.564953 0.060666
H  4.156008 -4.384015 -1.106832
H  2.758356 -3.924298 -2.121252
H  2.583163 -0.984375 -2.571672
H  3.736331 -0.196698 -1.446188
H  4.521446 -2.39849 -2.963566
H  5.142081 -2.124517 -1.308638
H  1.478861 0.74936 -1.287649
H  1.947285 1.432928 1.681307
H  3.267779 1.019509 0.577193
H  -0.350916 0.911258 1.035001
H  -0.885436 -0.607656 -1.136535
H  1.291124 3.347476 0.109725
H  2.70259 2.96978 -0.903315
H  -2.32897 -0.173176 0.904844
H  -2.844008 1.379999 0.180825
H  4.233188 3.378732 1.096407
H  2.820795 3.827462 2.07833
H  -3.776609 0.125071 -1.806522
H  -3.28047 -1.419457 -1.058692
H  2.303977 5.727091 0.557101
H  3.657903 5.269889 -0.513603
H  4.008309 -4.307238 2.566077
H  5.133046 5.717471 1.528621
H  4.152901 7.082117 1.280902
H  -4.554371 -2.366087 0.850998
H  -5.613229 1.507925 -0.795192
H  -0.321885 1.666462 -3.742042
H  -6.679138 -2.388329 2.176529
H  -7.741836 1.490433 0.527488
H  -8.282915 -0.458375 2.020754
