program: Gaussian 09
title: 000111734
version: EM64L-G09RevD.01
frameworkgroup: C1[X(C9H21O4P)]
method: RPBEPBE
basis: SDD
operation: Freq
keyword: #p
keyword: freq=noraman
keyword: PBEPBE/SDD
title: #p freq=noraman PBEPBE/SDD
converged: YES YES NO NO
title: Mulliken charges:
elementType: P O O O O C C C C C C C C C H H H H H H H H H H H H H H H H H H H H H
charge: 1.388993 -0.522781 -0.677062 -0.678250 -0.607263 -0.379516 -0.378413 -0.372722 -0.381389 -0.352825 -0.377748 -0.356758 -0.269447 -0.695945 0.192705 0.192621 0.197253 0.197231 0.190668 0.190657 0.195254 0.195656 0.187946 0.187944 0.218335 0.218713 0.195261 0.195239 0.234729 0.235282 0.215691 0.209677 0.209687 0.400081 0.400497
chargesum: 0.00000
title: Mulliken charges with hydrogens summed into heavy atoms:
elementType: P O O O O C C C C C C C C C
charge: 1.388993 -0.522781 -0.276981 -0.277753 -0.607263 0.005810 0.016071 0.008603 0.009521 0.023065 0.059300 0.033742 0.200564 -0.060891
polarizability: 1.88519683e+02 4.89527404e+00 1.14773763e+02 -1.31627001e-01 8.60275592e-02 1.11677654e+02
1716.lowfreq: -198.4263 -3.2062 -0.0004 0.0007 0.0009 7.2285 15.4758 22.4074 30.7535
frequency: -198.4262 22.2677 30.7510 44.7575 50.1115 76.6756 79.9525 82.4700 110.8560 126.6030 127.5136 147.5486 153.3922 158.0818 175.2419 225.6186 238.6142 272.5318 278.5918 312.9702 342.9785 354.8277 385.2944 415.1274 476.2075 480.7671 632.8155 720.0144 723.9125 729.1328 745.7646 746.4429 778.0843 825.7153 887.3873 889.8085 927.9547 959.2423 988.9739 989.1498 992.5312 1008.7862 1019.8151 1037.6783 1063.0353 1075.8347 1080.6226 1088.3129 1102.2568 1124.2307 1145.6287 1185.8459 1215.8780 1216.5823 1251.1969 1254.8246 1276.0894 1283.9720 1286.9351 1289.8374 1298.5448 1300.3171 1322.6223 1346.7684 1355.5753 1357.6728 1371.4280 1389.1958 1462.7168 1463.1699 1467.1035 1469.1053 1473.5917 1476.4660 1478.9954 1484.2709 1489.0987 1491.8327 2952.1775 2952.8124 2956.9479 2959.7139 2966.8963 2970.5057 2972.4610 2986.1420 2993.1050 2995.7103 3001.8775 3003.2582 3014.8909 3029.7912 3041.9347 3053.6796 3069.0510 3071.3347 3082.5718 3605.0733 3609.0051
redmass: 1.2856 4.8594 4.6801 4.6588 1.9150 1.7191 4.9690 3.2144 1.6856 2.7016 4.0664 1.8419 3.5483 2.1437 2.9150 1.1348 2.6254 2.7630 4.2373 3.1049 3.7206 9.3995 5.1961 4.1504 3.3293 3.1710 11.9793 7.5792 1.0684 1.0799 9.4575 1.1009 1.1330 1.1838 1.9084 1.2098 9.2738 1.1849 1.2512 4.2561 1.5861 4.1591 1.0990 3.4209 2.9415 2.6124 2.1417 2.5275 3.4840 2.9881 1.3575 1.7477 1.3109 1.4015 1.3052 1.2898 1.1318 1.0863 1.0802 1.2999 1.0903 1.1203 1.3527 1.4530 1.6660 1.6082 1.3914 1.2172 1.0716 1.0722 1.0675 1.0780 1.0801 1.0424 1.0824 1.0873 1.0917 1.0972 1.0587 1.0588 1.0589 1.0592 1.0590 1.0584 1.0367 1.0966 1.0984 1.0582 1.1010 1.0566 1.1035 1.1046 1.1045 1.1052 1.1007 1.0993 1.1091 1.0662 1.0667
irintensity: 61.4312 0.0141 0.2988 1.5328 0.0069 2.6828 1.0324 1.8905 1.8468 5.7602 30.1262 0.3948 39.7518 0.9078 63.5972 0.0007 24.6319 93.3632 36.6882 5.8639 0.7372 29.8177 19.6467 3.2928 1.2109 2.5762 29.2825 299.0744 29.9006 2.5132 190.6533 7.0430 0.0017 0.7633 2.5830 0.7124 230.8906 0.2103 16.3724 2.4781 7.0972 12.3528 0.3633 4.5776 4.4642 25.2519 0.3394 77.6863 195.3797 16.1268 1.0265 0.3548 14.8644 4.4735 0.0430 2.6808 0.1382 0.0154 1.1234 1.9451 0.0017 0.0272 0.8220 0.2230 0.3991 0.3364 9.0886 11.2454 0.0225 0.0413 0.3523 0.0856 1.7821 12.4300 0.0728 3.8451 3.2600 35.9826 0.0759 0.1213 3.3266 1.9511 15.6815 192.9905 35.2902 0.1058 0.2940 3.4143 0.6704 55.3168 1.9700 0.2909 132.0647 28.0090 97.6219 54.8279 66.8222 88.0342 56.8697
temp: 298.150 k
press: 1.00000 atm
elementType: 15 8 8 8 8 6 6 6 6 6 6 6 6 6 1 1 1 1 1 1 1 1 1 1 1 1 1 1 1 1 1 1 1 1 1
symmnumber: 1
zpe: 774590.7 jmol-1
zpe.correction: 0.295026 hartree
zpe.thermalcorrener: 0.314038 hartree
zpe.thermalcorrenthalpy: 0.314983 hartree
zpe.thermalcorrgfe: 0.245005 hartree
zpe.sumelectzpe: -996.490857 hartree
zpe.sumelectthermal: -996.471844 hartree
zpe.sumelectthermalent: -996.470900 hartree
zpe.sumelectthermalfe: -996.540878 hartree
dipole: -1.2817 -2.4000 0.1343
dipole: 2.7241
quadrupole: -96.1258 -102.6581 -88.4182
quadrupole: -16.3206 0.8610 0.7287
quadrupole: -0.3918 -6.9241 7.3158 -16.3206 0.8610 0.7287
hfenergy: -996.7858826 hartree
pointgroup: C01 [X(C9H21O4P1)]
dipole: -0.5130943 0.9386494 -0.0656725 debye
polarizability: 188.6031756|-4.2198687|114.6926808|-0.0811695|0.0552803|111.6752437 unknown
InChI: InChI=1S/C9H21O4P/c1-2-3-4-5-6-7-8-9-13-14(10,11)12/h10-11H,2-9H2,1H3
charge 0 multiplicity 1
35 atoms
P  5.124089 -0.006163 -0.02129
O  3.532082 -0.58744 0.02204
O  5.104548 0.993087 -1.433021
O  5.108116 1.161408 1.253664
O  6.281056 -1.085282 0.041111
C  -2.7464 0.367764 -0.002611
C  -1.458388 -0.485538 0.017182
C  -4.039603 -0.478131 0.019683
C  -0.168182 0.364865 -0.009457
C  -5.328027 0.37502 0.001982
C  1.1149 -0.500799 0.01759
C  -6.622511 -0.469818 0.024526
C  2.371747 0.364891 -0.019983
C  -7.903936 0.391524 0.006628
H  -2.744289 1.055676 0.868737
H  -2.746189 1.011968 -0.906802
H  -1.456334 -1.126675 0.922982
H  -1.460919 -1.174887 -0.852469
H  -4.043368 -1.165176 -0.852385
H  -4.040124 -1.123529 0.923035
H  -0.170343 1.001658 -0.918441
H  -0.169742 1.056619 0.858327
H  -5.32922 1.020545 -0.901398
H  -5.325806 1.062298 0.873984
H  1.125874 -1.190797 -0.84711
H  1.133017 -1.12354 0.931831
H  -6.624202 -1.156331 -0.846734
H  -6.620535 -1.114302 0.927347
H  2.43851 0.958533 -0.95076
H  2.43975 1.036628 0.855743
H  -8.81491 -0.234697 0.025075
H  -7.939435 1.06625 0.882875
H  -7.944769 1.021372 -0.902203
H  5.904325 0.889128 -2.007856
H  5.930518 1.165672 1.805378
