program: Gaussian 09
title: 000111724
version: EM64L-G09RevD.01
frameworkgroup: C1[X(C8H8ClNO4S)]
method: RPBEPBE
basis: SDD
operation: Freq
keyword: #p
keyword: freq=noraman
keyword: PBEPBE/SDD
title: #p freq=noraman PBEPBE/SDD
converged: YES YES NO NO
title: Mulliken charges:
elementType: Cl S O O O O N C C C C C C C C H H H H H H H H
charge: 0.038197 0.938774 -0.521156 -0.532209 -0.443857 -0.210573 -0.489939 -0.036372 -0.314827 -0.223733 0.385306 -0.178544 -0.312833 -0.594126 0.120177 0.337454 0.291950 0.325581 0.274292 0.250693 0.244482 0.255351 0.395911
chargesum: 0.00000
title: Mulliken charges with hydrogens summed into heavy atoms:
elementType: Cl S O O O O N C C C C C C C C
charge: 0.038197 0.938774 -0.521156 -0.532209 -0.047946 -0.210573 -0.164357 -0.036372 0.022627 0.068218 0.385306 0.095748 -0.312833 0.156400 0.120177
polarizability: 2.00106145e+02 9.67826143e-01 1.47537647e+02 1.35097288e+00 -1.26293448e+00 8.82633307e+01
1716.lowfreq: -7.2616 -2.8477 -0.0026 -0.0022 -0.0012 4.9616 21.4699 26.3572 39.9917
frequency: 21.4430 26.3459 39.9699 74.1143 102.7839 128.0447 153.3178 170.3137 182.0991 203.2585 214.7028 236.4471 279.8829 309.3393 333.7105 362.4794 386.6379 413.8501 428.5793 447.9918 474.5126 534.8863 553.7865 598.3196 606.2541 670.9819 691.7642 766.2575 783.6191 802.1136 816.2267 834.6981 938.3437 960.0466 974.5057 990.7776 1000.5380 1040.4826 1074.3506 1093.0249 1109.1666 1132.1347 1156.7185 1247.9579 1301.3924 1329.8366 1365.8187 1390.9514 1415.1676 1444.6332 1447.6232 1485.9049 1556.7005 1598.4467 1654.9243 2973.9763 3069.3230 3096.8804 3163.1388 3174.0047 3181.9768 3360.7685 3537.1317
redmass: 6.1185 13.0181 3.5199 5.4070 8.6853 2.6457 1.5076 4.7194 8.4904 4.2100 10.3029 10.0643 8.7567 5.8876 9.5257 7.2407 7.0749 7.1992 3.1773 6.5149 5.5090 3.4300 7.1213 1.6246 3.0606 6.2047 4.7349 5.4161 4.6646 2.4281 3.0252 1.3696 10.7338 1.4369 1.3859 5.8415 3.4173 5.0581 2.1579 1.3598 1.5185 1.8048 1.4574 1.3675 2.2478 1.1883 4.1110 6.7048 1.1289 2.5264 1.0552 1.0508 6.6730 8.3105 9.4457 1.0348 1.0995 1.1011 1.0896 1.0920 1.0975 1.0750 1.0644
irintensity: 1.1058 1.6020 2.1495 2.5393 2.6807 1.9671 1.5709 2.4003 2.8286 1.3935 2.3029 0.9131 7.8939 0.4983 0.5076 21.5480 62.2101 12.6027 10.3927 58.9821 61.4064 22.3299 19.8364 137.9861 74.4340 15.5185 12.7153 6.8432 26.9183 59.9610 123.9456 24.7398 68.0143 7.3352 6.9986 219.5850 3.0967 86.0916 17.1232 4.9344 14.9579 52.5334 55.1847 12.9397 72.5409 6.7508 12.6857 12.3265 7.5029 42.7729 19.4852 15.2268 8.3195 30.0631 265.9463 29.9422 13.9202 15.1704 2.5634 15.1089 2.0548 17.5392 57.7867
temp: 298.150 k
press: 1.00000 atm
elementType: 17 16 8 8 8 8 7 6 6 6 6 6 6 6 6 1 1 1 1 1 1 1 1
symmnumber: 1
zpe: 400242.8 jmol-1
zpe.correction: 0.152444 hartree
zpe.thermalcorrener: 0.168318 hartree
zpe.thermalcorrenthalpy: 0.169262 hartree
zpe.thermalcorrgfe: 0.106767 hartree
zpe.sumelectzpe: -1522.125295 hartree
zpe.sumelectthermal: -1522.109421 hartree
zpe.sumelectthermalent: -1522.108477 hartree
zpe.sumelectthermalfe: -1522.170972 hartree
dipole: -0.5652 0.3104 3.7847
dipole: 3.8392
quadrupole: -112.2231 -91.4562 -104.3597
quadrupole: -0.5444 -15.6941 0.9494
quadrupole: -9.5434 11.2234 -1.6800 -0.5444 -15.6941 0.9494
hfenergy: -1522.2777392 hartree
pointgroup: C01 [X(C8H8Cl1N1O4S1)]
dipole: -0.11496 -0.3065635 -1.474548 debye
dipolederiv: -0.6303311 -0.3057846 0.0775609 -0.2920576 -0.1795137 0.0394191 0.1033666 0.0539802 -0.0216817 2.0148857 0.2739599 0.1746796 0.303194 1.1864535 0.1245308 0.0494829 0.1072887 1.4305125 -0.7072965 -0.0806246 -0.0788371 -0.0944377 -0.6009769 0.1679213 -0.0197428 0.0144797 -0.6231526 -0.770002 0.0130713 0.0458999 -0.0002724 -0.5849642 -0.1997608 -0.0162318 -0.0533505 -0.5596651 -0.3250184 -0.1911746 0.0330025 -0.0628632 -1.236634 0.1350461 0.0245254 0.1074454 -0.4289187 -1.0268392 0.0187148 -0.0667473 0.2075967 -0.5731878 0.0553242 -0.0743544 0.033106 -0.3105683 -0.4876155 -0.0659803 -0.0872074 -0.004373 -0.5275382 0.0529848 -0.0533458 0.0417418 -0.4816434 -0.0519014 0.0876801 0.0226916 0.0585581 -0.2704806 0.0331235 0.0810593 0.0133897 -0.2015504 0.0055283 -0.091153 0.0074998 -0.2415998 -0.1155919 0.0011968 0.069133 -0.0047197 -0.0547399 -0.063597 -0.0996819 0.0021898 0.2309285 0.1150019 -0.0439657 -0.060048 -0.0242317 -0.0472327 -0.538939 0.1198392 -0.0369241 0.1937181 -0.4184208 0.1117099 -0.0457863 0.107415 0.0460696 -0.5179754 -0.0274177 0.0080806 -0.0258417 0.0327426 -0.0297201 0.009372 -0.0259652 -0.073634 1.0822073 0.5172028 -0.1496728 0.1643596 0.4029571 -0.1154778 -0.0986668 -0.1229434 -0.0309458 0.0580124 -0.0945771 -0.1826669 0.0833085 0.2886972 0.1113142 -0.0868836 -0.0686436 0.0235587 1.3825429 -0.1791254 0.1331789 -0.3457122 1.6566571 -0.2589172 0.1151755 -0.2265731 0.2804414 0.1924114 -0.0442336 0.0266501 -0.0134118 0.1289527 0.0003258 0.0046016 0.0097675 0.1474625 0.0870263 0.0593195 -0.0033645 0.031109 0.1134248 0.0180636 -0.0038658 0.0018426 0.1448693 0.0647569 0.0362159 0.0426415 -0.0682346 0.1830139 -0.1185215 -0.0038999 -0.1241074 0.1019875 0.0495332 -0.0452836 0.0103938 -0.0198273 0.0050241 0.0351345 0.0143951 0.0379262 0.1538516 -0.1035083 0.054483 0.0510865 0.0114355 0.0547933 -0.0243991 0.0235403 0.0262741 0.1151506 0.1016945 0.0101314 -0.0598177 -0.0187879 0.0548058 -0.0700805 -0.0979105 -0.032907 -0.0684672 0.0617989 -0.0457453 0.061982 -0.096866 -0.0843848 -0.0294359 0.0866553 0.1084334 0.0647641 0.1226261 0.0801639 -0.0322997 0.0000772 0.3691686 0.0041839 -0.0205713 0.0203515 0.3935321 unknown
polarizability: 199.0851635|6.9946018|147.4503184|4.6748299|-7.1975621|89.3716404 unknown
InChI: InChI=1S/C8H8ClNO4S/c1-10-15(13,14)5-2-3-7(9)6(4-5)8(11)12/h2-4,10-11H,1H3
charge 0 multiplicity 1
23 atoms
Cl 3.582469 1.942472 -0.401498
S  -2.495771 -0.116536 0.323323
O  -2.441456 -1.580335 1.043622
O  -3.362905 1.126837 0.918253
O  2.194174 -2.374355 0.55105
O  3.974946 -0.897308 0.400526
N  -3.061388 -0.257938 -1.459662
C  -0.712965 0.446571 0.097541
C  0.30501 -0.488384 0.287226
C  -0.477655 1.796616 -0.21275
C  1.662395 -0.078983 0.149805
C  0.860753 2.210244 -0.351732
C  1.914622 1.283133 -0.177951
C  -2.882064 -1.622301 -2.022703
C  2.741253 -1.091514 0.368238
H  0.077335 -1.522595 0.560614
H  -1.307068 2.501132 -0.325783
H  -4.056119 0.04026 -1.415068
H  1.096665 3.24959 -0.595135
H  -1.80589 -1.837872 -2.128848
H  -3.326184 -1.608599 -3.03419
H  -3.352766 -2.428735 -1.427598
H  2.935108 -3.0170 0.714721
