program: Gaussian 09
title: 000003313
version: EM64L-G09RevD.01
frameworkgroup: C1[X(C17H25NO3)]
method: RPBEPBE
basis: SDD
operation: Freq
keyword: #p
keyword: freq=noraman
keyword: PBEPBE/SDD
title: #p freq=noraman PBEPBE/SDD
converged: NO YES NO NO
title: Mulliken charges:
elementType: O O O N C C C C C C C C C C C C C C C C C H H H H H H H H H H H H H H H H H H H H H H H H H
charge: -0.276004 -0.256731 -0.455980 -0.156449 0.390851 -0.073362 -0.436809 0.037190 -0.498599 -0.783158 -0.759948 -0.778152 -0.685038 0.220494 -0.306714 0.388734 -0.365225 -0.379513 -0.228463 -0.219980 -0.239911 0.194355 0.218307 0.200070 0.249316 0.218944 0.251577 0.218446 0.212848 0.237440 0.222952 0.222996 0.220507 0.241997 0.224817 0.227079 0.248406 0.191342 0.245199 0.257916 0.367347 0.245199 0.267008 0.224702 0.226333 0.227667
chargesum: 0.00000
title: Mulliken charges with hydrogens summed into heavy atoms:
elementType: O O O N C C C C C C C C C C C C C C C C C
charge: -0.276004 -0.256731 -0.088633 -0.156449 0.390851 0.120992 -0.018432 0.286506 -0.028078 -0.114423 -0.093494 -0.084260 -0.000091 0.220494 -0.048798 0.388734 -0.120026 -0.112505 -0.003761 0.006352 -0.012245
polarizability: 2.26761198e+02 5.78441815e+00 1.92603183e+02 1.75697424e+01 -6.80285967e+00 1.63525169e+02
1716.lowfreq: -0.0005 -0.0005 -0.0002 1.9947 5.8695 13.5187 22.0583 25.8475 31.9007
frequency: 21.6206 24.5685 31.7098 56.2741 67.3536 81.3464 86.9091 135.2706 173.7758 182.9299 205.8197 208.6344 227.3539 250.1099 254.8232 263.3040 269.8904 284.9813 321.6816 327.1529 334.0790 354.5054 383.6680 398.7948 406.9466 422.0432 429.8445 434.9328 457.5474 468.9680 482.0301 505.2102 518.3015 573.3080 612.1972 615.9968 649.1994 675.5772 700.1444 717.9396 758.5299 781.6760 829.2242 836.5220 845.8108 856.9844 890.6030 898.6179 916.0858 929.9842 935.6980 942.7666 974.3083 980.0678 989.5857 994.7953 998.4817 1018.9937 1028.1143 1031.0544 1046.8244 1066.5313 1075.9197 1085.0354 1109.2374 1134.9226 1146.4767 1165.0607 1168.4735 1172.3483 1174.7145 1186.9681 1188.3778 1212.8695 1222.9638 1225.9039 1247.5475 1253.7609 1272.2437 1291.4350 1310.9177 1319.6474 1322.8709 1344.8133 1355.4508 1363.3417 1368.2958 1372.7919 1380.9388 1388.0951 1388.4099 1433.7455 1436.4272 1451.4787 1463.7393 1468.5744 1472.0079 1478.2897 1478.5917 1481.5291 1486.9028 1493.1941 1496.3654 1508.2886 1594.7820 1605.4905 1613.3549 2852.7877 2874.5124 2980.3502 2982.8097 2989.2879 2990.7056 3002.1589 3017.7150 3033.6424 3048.5747 3059.0051 3067.3994 3072.0988 3076.6530 3079.2390 3086.6758 3090.6082 3098.8168 3112.9681 3122.4001 3132.2134 3144.9199 3158.1539 3170.0026 3444.5064
redmass: 4.2191 4.0127 3.8212 3.8323 6.0892 4.9153 3.0947 4.6762 2.7592 1.4176 1.7833 2.0327 2.1784 1.9063 3.8115 1.4689 1.2682 3.7520 2.1696 3.7919 3.1989 2.7854 2.2353 2.4570 3.1538 2.5740 2.1120 1.6039 3.2621 2.8502 3.0125 2.9202 3.1534 5.1561 3.9838 5.6265 5.4879 3.4329 2.8755 1.8845 2.5076 2.4684 2.4425 3.3648 2.4249 1.2475 2.6079 2.6364 1.5877 2.0162 1.8355 1.9023 1.3379 1.4321 4.5938 1.3806 1.3624 4.2098 2.2546 1.9113 1.8983 1.5215 2.8137 1.6099 1.3556 2.7011 2.0859 2.7044 1.4239 1.9977 1.4396 2.1543 1.3200 2.2264 1.6979 1.8733 2.0501 1.9143 1.3519 1.4129 1.2860 1.3142 1.2739 1.4496 1.4504 1.5967 1.6361 1.2321 1.2243 2.2531 1.6413 1.1431 2.1829 1.0822 1.0541 1.0595 1.0553 2.0265 1.1048 1.0731 1.0572 1.0538 1.0654 1.0490 6.2938 7.8305 6.9911 1.0797 1.0591 1.0354 1.0385 1.0564 1.0372 1.0623 1.0841 1.0856 1.1006 1.0728 1.1024 1.0987 1.0985 1.0986 1.1001 1.0988 1.0986 1.0979 1.0846 1.0883 1.0936 1.0971 1.0979 1.0648
irintensity: 0.0626 0.1386 0.0652 0.1914 1.2733 0.5785 0.1699 0.4139 4.0439 0.7795 0.8089 2.0843 4.7368 0.7584 0.5496 0.5457 0.1811 9.0943 6.2922 17.9617 2.7693 4.7140 34.9896 14.0665 9.8042 2.7200 5.5984 60.0016 4.1863 4.0567 7.8376 14.7549 6.7663 9.5462 1.7832 1.8411 16.4697 5.5253 12.7608 80.6006 15.6910 1.9930 11.4827 1.3968 23.7119 0.6128 23.0594 9.6932 10.7313 23.7187 7.0133 28.1277 11.8996 0.4298 0.3592 18.0911 0.6993 129.7089 33.8281 13.1764 11.0885 12.3001 10.8898 14.2261 1.6262 32.5543 85.0000 169.1971 2.9722 98.4732 17.1775 2.6034 3.1294 29.1180 167.4417 16.7077 28.7986 8.8090 3.7738 4.3350 9.6863 5.7028 6.4471 1.8422 1.0151 33.3037 23.6126 28.5125 15.6244 24.9523 8.3705 6.2933 12.7614 3.6084 2.3869 18.0086 1.4924 21.2098 3.6821 23.3005 13.4410 2.4672 8.8628 14.4910 1.9392 117.6431 50.3574 50.6120 112.3729 21.3410 23.1978 41.5614 19.6451 13.5139 13.6567 13.1802 18.8898 37.3872 26.1494 1.9851 57.9078 43.5827 28.6384 28.3231 39.0481 18.3576 0.4752 7.0249 30.0785 21.2965 13.8228 46.2269
temp: 298.150 k
press: 1.00000 atm
elementType: 8 8 8 7 6 6 6 6 6 6 6 6 6 6 6 6 6 6 6 6 6 1 1 1 1 1 1 1 1 1 1 1 1 1 1 1 1 1 1 1 1 1 1 1 1 1
symmnumber: 1
zpe: 1023218.7 jmol-1
zpe.correction: 0.389723 hartree
zpe.thermalcorrener: 0.411218 hartree
zpe.thermalcorrenthalpy: 0.412162 hartree
zpe.thermalcorrgfe: 0.338647 hartree
zpe.sumelectzpe: -941.599743 hartree
zpe.sumelectthermal: -941.578249 hartree
zpe.sumelectthermalent: -941.577304 hartree
zpe.sumelectthermalfe: -941.650819 hartree
dipole: -3.4014 2.7582 -0.9184
dipole: 4.4744
quadrupole: -127.3636 -127.8592 -125.8130
quadrupole: 6.7392 5.0057 2.0472
quadrupole: -0.3516 -0.8473 1.1990 6.7392 5.0057 2.0472
hfenergy: -941.9894661 hartree
pointgroup: C01 [X(C17H25N1O3)]
dipole: 1.2840318 1.2033939 0.0445094 debye
polarizability: 221.6186966|3.8229159|193.2289129|25.2178603|-4.6104662|168.0419403 unknown
InChI: InChI=1S/C17H25NO3/c1-12-14(10-11-17(2,3)18(12)4)21-16(20)15(19)13-8-6-5-7-9-13/h5-9,12,14-15,19H,10-11H2,1-4H3
charge 0 multiplicity 1
46 atoms
O  -0.220577 -0.683411 0.601685
O  -0.799188 -2.452587 -0.809973
O  -3.309225 -2.563934 0.195904
N  3.47808 -0.014679 0.790288
C  3.677701 0.816473 -0.464082
C  2.05704 -0.108473 1.257649
C  2.791955 0.198203 -1.584193
C  1.212144 -0.718473 0.116733
C  1.308254 0.068288 -1.191272
C  5.149113 0.69414 -0.938246
C  3.33778 2.325351 -0.257612
C  1.923065 -0.98068 2.523809
C  4.412286 0.319827 1.890779
C  -1.101233 -1.566635 0.030469
C  -2.547229 -1.373497 0.534439
C  -3.16215 -0.093611 -0.06222
C  -2.733125 1.18333 0.37897
C  -4.174731 -0.188527 -1.04437
C  -3.30507 2.352989 -0.168155
C  -4.743116 0.983574 -1.593949
C  -4.309949 2.257153 -1.159943
H  1.631678 0.902244 1.487369
H  3.197186 -0.804115 -1.824243
H  2.881246 0.818752 -2.49558
H  1.489937 -1.778034 -0.037944
H  0.848011 1.064508 -1.050282
H  0.743276 -0.448423 -1.987286
H  5.230056 1.041064 -1.984657
H  5.845224 1.306527 -0.338055
H  5.475689 -0.360473 -0.896401
H  2.282007 2.487772 0.023181
H  3.970857 2.765411 0.534407
H  3.526969 2.889984 -1.18907
H  0.856032 -1.18253 2.71665
H  2.444953 -1.945361 2.383577
H  2.332123 -0.483883 3.419033
H  4.392783 -0.473695 2.654305
H  4.189798 1.289765 2.400025
H  5.440964 0.365125 1.502596
H  -2.520709 -1.287276 1.636484
H  -2.783556 -3.065343 -0.489027
H  -1.950388 1.260916 1.142163
H  -4.524065 -1.180313 -1.346445
H  -2.9713 3.336797 0.18105
H  -5.529267 0.901059 -2.35308
H  -4.754532 3.165004 -1.583177
