program: Gaussian 09
title: 000002785
version: EM64L-G09RevD.01
frameworkgroup: C1[X(C22H26N4O4)]
method: RPBEPBE
basis: SDD
operation: Freq
keyword: #p
keyword: freq=noraman
keyword: PBEPBE/SDD
title: #p freq=noraman PBEPBE/SDD
converged: YES YES NO NO
title: Mulliken charges:
elementType: O O O O N N N N C C C C C C C C C C C C C C C C C C C C C C H H H H H H H H H H H H H H H H H H H H H H H H H H
charge: -0.288021 -0.271262 -0.152640 -0.336629 -0.375964 -0.119833 -0.347405 -0.153783 -0.145376 -0.678887 0.529645 0.243773 -0.416683 -0.417513 0.132257 -0.631128 -0.668921 0.120961 -0.649421 -0.376910 -0.229558 -0.238559 -0.495682 -0.243763 0.288250 0.281038 -0.350826 -0.164317 -0.342172 -0.175528 0.276654 0.265822 0.222342 0.386590 0.226183 0.272447 0.228028 0.280745 0.223592 0.223868 0.317084 0.227357 0.279687 0.248604 0.229253 0.263580 0.241062 0.222053 0.220979 0.218810 0.223722 0.390184 0.244419 0.247210 0.254009 0.240573
chargesum: 0.00000
title: Mulliken charges with hydrogens summed into heavy atoms:
elementType: O O O O N N N N C C C C C C C C C C C C C C C C C C C C C C
charge: -0.288021 -0.271262 -0.152640 -0.336629 0.010627 -0.119833 0.042780 -0.153783 0.131278 -0.190723 0.529645 0.243773 -0.190501 -0.145067 0.132257 0.101237 0.099388 0.120961 -0.121130 0.115923 -0.008579 -0.019750 -0.032567 -0.020041 0.288250 0.281038 -0.106407 0.082893 -0.088163 0.065045
polarizability: 3.55300596e+02 2.64820085e+01 2.47948070e+02 2.42093773e+00 -9.18425077e+00 2.29578734e+02
1716.lowfreq: -8.7793 -4.8538 -2.3776 -0.0006 -0.0004 0.0007 5.1029 13.6917 20.3793
frequency: 4.4134 13.6589 20.3694 25.7190 33.1610 38.2872 46.0151 52.4401 55.9674 63.8179 71.2466 82.1529 107.5791 108.2835 118.3182 140.6648 148.5479 162.3315 167.3591 185.9373 220.2268 234.3105 245.4195 250.4038 259.9245 274.9875 284.7965 297.5594 337.7044 351.3719 367.7076 403.3627 405.2337 406.1262 417.9838 426.6757 441.7425 458.7675 487.7904 512.5398 538.8985 556.6608 572.8112 588.9613 617.1606 617.8778 620.7289 630.5107 704.9262 706.2929 709.0145 749.0847 754.2794 757.7295 783.1540 790.7645 801.1072 823.9335 847.1708 852.9560 861.6692 873.0459 882.8895 899.3331 903.4221 925.1990 932.0453 945.2693 950.8274 964.8100 966.5441 978.3201 989.1132 994.8804 999.0796 1005.7013 1025.3149 1029.2944 1032.4541 1043.1796 1055.2237 1059.5550 1074.9721 1090.6277 1092.3912 1097.2597 1111.7811 1130.2985 1141.2497 1167.6542 1169.6197 1171.0902 1192.0534 1195.6711 1198.3535 1210.1343 1219.8528 1232.5192 1235.2260 1257.6546 1265.1419 1279.4997 1298.0993 1302.8269 1305.2741 1317.0314 1328.5542 1336.1624 1342.0896 1353.6208 1381.7831 1383.3211 1410.8688 1418.2868 1441.2475 1445.2180 1445.7879 1449.3229 1460.2175 1468.0716 1472.3812 1484.6821 1486.1082 1489.2129 1495.8341 1511.8411 1512.1426 1558.9955 1566.1119 1580.6296 1589.2212 1589.9326 1593.6806 1614.9245 1622.8575 1633.4336 2957.7108 2971.0007 2978.7987 2989.6604 3003.4774 3023.2461 3047.1283 3053.1447 3054.2157 3059.4831 3070.6957 3072.7935 3083.6775 3100.4540 3108.7264 3113.8387 3117.8317 3120.3225 3133.1047 3138.7728 3143.3749 3144.2687 3159.1909 3159.4922 3178.2293 3224.4063
redmass: 5.8627 5.1348 5.4295 4.2217 4.7293 4.5758 5.5649 4.3245 4.9453 4.4169 6.6992 6.3934 3.8805 4.0271 4.4290 2.7165 1.8926 1.7010 4.1203 2.7895 3.0666 3.9279 4.2180 4.3968 4.4393 3.9986 3.0740 5.0129 2.5969 6.7462 3.2388 3.9338 3.6620 3.2959 2.7259 2.6638 2.3628 4.0146 3.8920 4.9205 4.7324 3.9842 4.2077 3.5130 5.5665 5.3636 5.5383 6.0136 2.5815 3.3061 7.2992 3.6088 1.8987 1.6373 2.1048 5.1905 4.9242 3.0476 2.5926 1.4572 3.1507 1.5647 1.6575 1.1912 1.2843 1.7723 2.7007 2.1099 2.8855 1.4281 3.9431 1.4080 3.5209 1.5280 3.2247 1.3471 2.3894 2.1142 2.5135 2.2916 2.5237 1.5161 3.4473 1.9021 1.6504 1.2644 2.8076 1.6492 1.3771 1.3681 1.1241 1.0563 1.1631 1.3189 1.4720 1.2432 2.3143 2.1146 4.5190 1.5438 1.4931 2.0343 1.7181 2.2828 2.6018 1.3356 1.4635 1.2514 1.7191 1.4481 3.8217 4.4098 1.2011 1.9616 2.1738 1.1645 1.1430 1.1593 1.9359 1.1064 1.0739 1.0927 2.2711 1.0702 1.1358 1.5658 1.1269 2.1097 5.8451 7.9906 5.6437 6.0356 5.8829 5.9935 2.6174 9.6688 1.0373 1.0357 1.0684 1.0621 1.0609 1.0582 1.1017 1.0959 1.0930 1.0974 1.0966 1.0964 1.1007 1.1047 1.0872 1.0898 1.0977 1.0860 1.0916 1.0873 1.0961 1.0906 1.0955 1.1016 1.1013 1.0848
irintensity: 1.1493 1.7392 0.5332 0.9497 2.7701 0.5098 0.3931 0.3498 0.1262 2.6149 7.7764 7.5546 3.2844 0.9413 7.7086 3.4207 0.9769 1.3082 2.0631 7.9615 0.7381 4.6628 4.2014 6.9686 1.0739 6.2413 2.9056 5.0700 8.6713 10.6078 13.9652 6.6899 8.5353 5.7652 5.3094 9.5351 0.5382 15.5822 18.3692 5.2176 15.6886 11.3677 1.3569 4.5298 7.1707 5.2792 3.1243 12.7808 38.1184 28.4301 6.2066 5.9953 39.6996 51.4337 26.9409 0.4462 4.5630 5.9731 2.9357 10.8503 5.2502 44.5186 37.7957 38.8765 29.8792 5.6158 23.5592 30.8938 5.0822 1.7658 6.6406 2.4191 0.9351 1.8197 71.4581 0.2791 4.3357 13.5913 5.2228 1.0664 79.4595 25.6999 7.9849 42.7373 11.7718 4.5011 2.7859 98.8273 1.3633 57.8395 26.2904 0.6048 0.5896 3.0633 20.8105 143.6629 0.1250 1.5879 17.1177 52.1442 13.6676 44.0904 40.8577 9.7156 6.6045 3.8605 8.4769 0.8955 20.4688 14.4945 40.0825 25.5501 47.6283 17.2897 7.7216 24.9342 27.5306 9.4457 18.9169 40.0041 11.4185 40.8222 18.4049 16.1756 11.7713 401.3557 61.5570 460.4556 8.7298 308.4276 13.5279 297.1887 39.1585 10.5383 121.2672 73.9657 75.7792 104.3173 21.2617 21.1996 19.5232 3.9763 38.7556 21.5311 16.8848 23.8456 36.8392 12.7190 15.6337 19.4228 5.7363 756.8477 3.7361 41.3849 52.3664 7.6781 12.2612 2.1703 18.2145 29.8720 28.9231 740.5027
temp: 298.150 k
press: 1.00000 atm
elementType: 8 8 8 8 7 7 7 7 6 6 6 6 6 6 6 6 6 6 6 6 6 6 6 6 6 6 6 6 6 6 1 1 1 1 1 1 1 1 1 1 1 1 1 1 1 1 1 1 1 1 1 1 1 1 1 1
symmnumber: 1
zpe: 1181324.1 jmol-1
zpe.correction: 0.449943 hartree
zpe.thermalcorrener: 0.479512 hartree
zpe.thermalcorrenthalpy: 0.480456 hartree
zpe.thermalcorrgfe: 0.382758 hartree
zpe.sumelectzpe: -1371.672279 hartree
zpe.sumelectthermal: -1371.642710 hartree
zpe.sumelectthermalent: -1371.641766 hartree
zpe.sumelectthermalfe: -1371.739464 hartree
dipole: 7.7135 0.2136 -1.5921
dipole: 7.8790
quadrupole: -95.6333 -168.6092 -197.4692
quadrupole: 7.3092 -7.3422 0.8167
quadrupole: 58.2706 -14.7053 -43.5653 7.3092 -7.3422 0.8167
hfenergy: -1372.1222221 hartree
pointgroup: C01 [X(C22H26N4O4)]
dipole: -3.0559158 -0.2111695 -0.4752491 debye
polarizability: 359.4190077|-11.8561503|235.6040329|-11.7216444|-10.1990939|237.8043582 unknown
InChI: InChI=1S/C22H26N4O4/c1-26(2)22(30)18(14-16-8-4-3-5-9-16)25-21(29)19(27)15-20(28)24-13-11-17-10-6-7-12-23-17/h3-10,12,18,24-25H,11,13-15H2,1-2H3
charge 0 multiplicity 1
56 atoms
O  3.575676 -2.347574 -1.737004
O  2.853998 2.0380 -0.671105
O  0.049978 2.770357 -0.795066
O  -0.511192 -1.248292 -0.222371
N  2.045641 -0.134321 -0.328909
N  5.18056 -0.653642 -1.691184
N  -2.499554 -0.204676 -0.8298
N  -4.867952 1.002525 -1.528807
C  3.352099 -0.701094 0.055038
C  3.167513 -1.848045 1.09219
C  2.617733 -1.368209 2.427201
C  4.04813 -1.288742 -1.206024
C  3.497496 -0.887829 3.432101
C  1.223838 -1.376476 2.693393
C  1.906019 1.188226 -0.654501
C  5.895934 -1.26431 -2.828236
C  5.738828 0.612413 -1.165478
C  0.467484 1.617019 -1.045927
C  -0.406172 0.61036 -1.830146
C  -3.364514 -1.038523 0.02307
C  3.002679 -0.424447 4.671485
C  0.725986 -0.914127 3.933084
C  -4.713515 -1.318855 -0.683902
C  1.61154 -0.436213 4.926311
C  -1.151422 -0.359523 -0.893673
C  -5.53653 -0.073136 -0.989926
C  -6.933465 -0.024702 -0.75639
C  -7.655635 1.142468 -1.090406
C  -5.570878 2.127834 -1.840811
C  -6.964629 2.242969 -1.645515
H  3.949442 0.110644 0.50081
H  2.518626 -2.616188 0.634182
H  4.158352 -2.318007 1.237781
H  1.202311 -0.753625 -0.306209
H  4.579245 -0.884093 3.244244
H  0.527331 -1.736154 1.926903
H  5.860543 -0.599745 -3.712545
H  5.407533 -2.219354 -3.073819
H  6.955005 -1.444673 -2.563268
H  6.423696 0.437733 -0.311862
H  4.934783 1.307954 -0.871047
H  6.318105 1.095918 -1.970997
H  0.230958 0.003993 -2.498147
H  -1.122092 1.194465 -2.431469
H  -3.543176 -0.528111 0.99102
H  -2.833124 -1.98136 0.23762
H  -4.504264 -1.852858 -1.632335
H  -5.309829 -2.003052 -0.053804
H  3.697661 -0.059493 5.436568
H  -0.353609 -0.926671 4.123237
H  1.223886 -0.078934 5.887266
H  -3.023009 0.53603 -1.340645
H  -7.441239 -0.890466 -0.319333
H  -8.735587 1.193574 -0.916798
H  -4.989485 2.957474 -2.257192
H  -7.484234 3.166563 -1.916451
