program: Gaussian 09
title: 000111561
version: EM64L-G09RevD.01
frameworkgroup: C1[X(C9H11ClO)]
method: RPBEPBE
basis: SDD
operation: Freq
keyword: #p
keyword: freq=noraman
keyword: PBEPBE/SDD
title: #p freq=noraman PBEPBE/SDD
converged: YES YES NO NO
title: Mulliken charges:
elementType: Cl O C C C C C C C C C H H H H H H H H H H H
charge: -0.042459 -0.247478 0.464148 0.451572 -0.294789 -0.344962 -0.328372 -0.439200 -0.244718 -0.805717 -0.682213 0.247081 0.255051 0.230485 0.209370 0.209277 0.231515 0.223490 0.231446 0.205713 0.235363 0.235396
chargesum: 0.00000
title: Mulliken charges with hydrogens summed into heavy atoms:
elementType: Cl O C C C C C C C C C
charge: -0.042459 -0.247478 0.464148 0.451572 -0.294789 -0.089911 -0.081291 -0.208715 0.173929 -0.119265 -0.005741
polarizability: 1.53860576e+02 -5.28304444e+00 1.21276726e+02 3.42330696e-02 2.00053236e-02 5.81811706e+01
1716.lowfreq: -0.0024 0.0004 0.0016 2.4472 11.4813 11.5635 51.1335 61.3460 109.0499
frequency: 51.0786 61.3429 109.0489 118.5229 146.4257 176.3237 208.3409 244.3627 296.8002 319.4077 341.7811 399.3441 438.5723 473.6033 547.3354 563.8860 671.9057 712.9583 729.5992 799.4663 833.1129 851.3431 874.5357 909.4388 933.2532 998.6160 1031.1154 1040.2164 1047.1932 1116.1364 1135.7819 1157.4319 1211.7604 1242.4766 1264.2074 1273.5650 1358.4723 1371.7659 1400.1938 1401.4485 1405.5364 1460.6394 1471.3044 1475.4198 1477.0353 1484.9970 1497.3633 1568.2376 1621.5307 2955.3185 2976.6258 2998.4960 3014.4697 3054.0604 3084.6235 3095.9487 3109.0021 3132.1970 3148.3187 3166.7229
redmass: 1.3717 1.9197 1.7894 4.4138 4.1906 4.0664 5.0457 1.1780 3.8472 3.5644 4.8421 6.5749 3.1813 4.2525 5.1100 3.4177 7.1083 3.4130 4.2865 1.3915 1.1156 4.8106 1.3458 3.6595 1.3492 1.4123 2.9772 2.8830 1.5173 2.2126 1.4369 1.3646 1.6681 6.0495 1.1403 1.5455 2.6913 1.6054 1.2725 1.2531 4.1486 1.0396 1.0455 1.2006 1.1004 1.2827 1.6990 6.0694 7.0553 1.0552 1.0373 1.0363 1.1076 1.0979 1.0985 1.0989 1.1014 1.0890 1.0923 1.0940
irintensity: 1.4115 0.4563 3.7664 1.0465 0.1004 0.6633 0.5518 0.5150 0.3367 2.6981 1.7272 2.3347 5.4268 1.0831 5.8500 6.4315 8.2505 0.5370 18.5159 56.1209 0.2778 23.4326 9.6228 31.8265 0.6699 12.8395 8.7153 94.6498 11.1192 3.8844 4.8225 22.6235 21.6735 229.2328 0.0115 6.9286 7.5725 10.9915 16.7687 26.2863 5.4040 12.0198 13.0496 68.5199 15.5362 60.8253 57.6285 10.3228 11.8298 39.6220 43.3015 23.1160 36.8109 21.6078 19.5613 27.3149 32.4180 16.2809 5.0007 12.0653
temp: 298.150 k
press: 1.00000 atm
elementType: 17 8 6 6 6 6 6 6 6 6 6 1 1 1 1 1 1 1 1 1 1 1
symmnumber: 1
zpe: 460921.3 jmol-1
zpe.correction: 0.175556 hartree
zpe.thermalcorrener: 0.187167 hartree
zpe.thermalcorrenthalpy: 0.188111 hartree
zpe.thermalcorrgfe: 0.137170 hartree
zpe.sumelectzpe: -884.005429 hartree
zpe.sumelectthermal: -883.993817 hartree
zpe.sumelectthermalent: -883.992873 hartree
zpe.sumelectthermalfe: -884.043815 hartree
dipole: 0.1817 -3.2471 0.0022
dipole: 3.2522
quadrupole: -59.5091 -70.0980 -75.2747
quadrupole: 5.1167 0.0053 0.0059
quadrupole: 8.7848 -1.8040 -6.9808 5.1167 0.0053 0.0059
hfenergy: -884.1809846 hartree
pointgroup: C01 [X(C9H11Cl1O1)]
dipole: -0.0872265 1.2754741 -0.0516683 debye
dipolederiv: -0.2060384 0.2261864 -0.0062587 0.2734413 -0.6559967 0.0193466 -0.0083294 0.0204374 -0.0583248 -1.8877305 -0.304717 0.0496357 -0.2166132 -0.3078678 0.0068596 0.0455996 0.0086063 -0.2621737 0.2951464 -0.0278534 -0.0070029 0.022717 -0.1066417 0.0019106 -0.0099137 0.0031176 -0.0515303 1.4760883 0.2454666 -0.0413579 -0.1339364 -0.2450787 0.017924 -0.0251541 0.0095544 0.1068079 -0.0349865 -0.3096805 0.0117194 -0.529339 0.9455456 -0.0321238 0.0212787 -0.037202 -0.0891043 -0.1016574 0.0374666 -0.002162 0.1386849 -0.1039863 -0.0043456 -0.0064479 -0.0020021 -0.1251921 -0.2300834 -0.1702941 0.0080395 0.276727 0.0156646 -0.0152643 -0.011074 -0.0049433 -0.1912777 -0.0558767 0.1277672 -0.0080656 -0.1088496 0.1131205 -0.0098235 0.0023049 -0.0154391 -0.169427 0.8677501 0.226242 -0.0203225 0.5836635 0.4638754 -0.015999 -0.0354466 -0.007947 0.3983951 -0.0973712 -0.0039269 0.0042669 -0.0611263 0.0644612 0.0018908 0.0075802 0.0006139 0.0758797 -0.1476965 0.0290735 0.0028432 -0.001366 0.051453 0.0001349 0.0041557 -0.0005495 0.0504316 0.0197357 -0.0868864 0.0071532 -0.1053514 -0.0304202 0.0109003 0.0078601 0.010416 0.1652982 0.040243 -0.0750867 0.0058757 -0.0775585 -0.0003016 0.0085235 0.0060151 0.0083938 0.1543485 0.026327 0.0924929 -0.0011225 0.0912438 -0.0741015 0.0078694 -0.0010735 0.0079286 0.1543745 -0.0316558 0.0431082 -0.0718187 -0.0964145 -0.0535662 0.093575 -0.0209705 0.1132938 -0.0968658 -0.0276109 0.0445966 0.0657329 -0.0978833 -0.071762 -0.0915 0.0270266 -0.1173368 -0.0822802 -0.0323145 -0.0106319 0.0551563 -0.0389228 0.0664017 0.0957646 0.1256934 0.0709392 -0.0566756 0.043961 0.016269 0.0007287 0.126293 -0.1324929 0.0080997 -0.0043212 0.0105104 0.1080549 -0.0402699 -0.0191321 -0.0541364 -0.055019 0.0502158 -0.1030709 -0.1218823 -0.0796154 -0.0321364 -0.0575724 -0.1030742 0.0081734 -0.1427559 -0.0587295 0.0106295 0.0098726 0.0097932 0.1143913 0.0897075 0.0128886 -0.0143096 0.0763619 0.0440466 0.0972994 -0.0497291 0.0952404 -0.0643806 0.0919052 0.0097255 0.007232 0.0760035 0.0261609 -0.108601 0.0369554 -0.1038098 -0.0486134 unknown
polarizability: 153.9364092|-4.966729|121.0440578|-1.9731092|-2.5947992|58.3380056 unknown
InChI: InChI=1S/C9H11ClO/c1-3-11-9-5-4-7(2)6-8(9)10/h4-6H,3H2,1-2H3
charge 0 multiplicity 1
22 atoms
Cl 0.412684 -2.83605 -0.046562
O  1.871338 -0.257337 -0.190241
C  -2.369649 0.203243 -0.113084
C  0.493101 -0.038653 -0.16854
C  -0.345579 -1.18328 -0.099896
C  -1.743129 -1.072006 -0.072381
C  -0.129262 1.234023 -0.20941
C  -1.538343 1.344725 -0.18178
C  2.753984 0.925772 -0.260259
C  -3.883978 0.316747 -0.082602
C  4.186524 0.400232 -0.266286
H  0.478781 2.141704 -0.262604
H  -2.349022 -1.982896 -0.018954
H  -1.99306 2.341511 -0.214837
H  2.528867 1.498397 -1.183629
H  2.565449 1.577513 0.617684
H  -4.304645 -0.127861 0.838929
H  -4.207525 1.371055 -0.123221
H  -4.346724 -0.209503 -0.938589
H  4.899412 1.243211 -0.318111
H  4.39169 -0.178439 0.650101
H  4.355285 -0.257407 -1.135627
