program: Gaussian 09
title: 000111560
version: EM64L-G09RevD.01
frameworkgroup: C1[X(C27H25N2S)]
method: RPBEPBE
basis: SDD
operation: Freq
keyword: #p
keyword: freq=noraman
keyword: PBEPBE/SDD
title: #p freq=noraman PBEPBE/SDD
converged: YES YES NO NO
title: Mulliken charges:
elementType: S N N C C C C C C C C C C C C C C C C C C C C C C C C C C C H H H H H H H H H H H H H H H H H H H H H H H H H
charge: 0.275615 -0.206201 -0.153628 0.526026 0.247834 -0.453167 -0.033370 -0.425739 0.446102 -0.317935 0.253131 -0.459610 0.237406 -0.320785 0.386606 -0.245857 -0.662348 -0.427905 -0.374719 -0.236183 -0.331723 -0.309218 -0.166576 -0.279944 -0.325734 -0.359750 -0.231817 -0.244770 -0.258991 -0.649716 0.250572 0.266662 0.258818 0.260632 0.240497 0.247685 0.238448 0.244976 0.243520 0.256184 0.245450 0.234417 0.254380 0.228313 0.210977 0.212430 0.244220 0.256032 0.229332 0.250766 0.252436 0.251440 0.236428 0.245467 0.242883
chargesum: 1.00000
title: Mulliken charges with hydrogens summed into heavy atoms:
elementType: S N N C C C C C C C C C C C C C C C C C C C C C C C C C C C
charge: 0.275615 -0.206201 -0.153628 0.526026 0.247834 -0.453167 -0.033370 0.091495 0.446102 -0.059117 0.253131 -0.198978 0.237406 -0.080288 0.386606 0.001828 0.064597 -0.171722 0.105148 0.018197 -0.103410 -0.098241 0.045854 -0.035724 -0.069701 -0.130418 0.018949 0.007666 -0.007551 0.075062
polarizability: 1.07634092e+03 -9.86695046e+00 3.54504378e+02 4.12968772e+00 3.26818679e+00 1.38734161e+02
1716.lowfreq: -7.6259 -4.9124 -0.0820 -0.0012 0.0006 0.0015 13.6102 17.3835 24.4599
frequency: 12.5952 17.2008 24.3905 42.4638 53.8162 78.7449 85.1122 101.4596 114.4047 117.8526 128.3253 140.8697 159.4079 172.4669 194.5579 203.2125 205.9388 226.5298 238.9078 262.2366 279.3842 286.0886 319.9607 343.2846 360.2647 364.4039 381.1985 395.4444 420.1416 428.9514 445.7027 469.5463 483.2399 487.6977 497.7053 505.1714 505.6451 524.2612 540.5222 560.4074 568.4655 593.6364 601.1801 604.0207 633.6684 650.5764 666.0468 675.4451 688.4978 724.6345 756.1374 758.7220 772.6450 780.6189 788.8301 794.3175 800.5568 806.9402 810.8877 820.8978 822.3948 836.5276 865.7191 874.6220 880.7142 883.7804 922.0711 941.5443 942.7927 955.7322 958.2528 962.7794 977.1867 998.5687 1001.2325 1003.5027 1015.4172 1042.6460 1045.3066 1053.6011 1070.9914 1084.1356 1088.4528 1120.5851 1137.8250 1155.2866 1163.0982 1165.7981 1189.2735 1189.4430 1195.2849 1205.1350 1227.9243 1237.1145 1240.9500 1250.8829 1258.1651 1267.4372 1279.5988 1288.8778 1301.0467 1314.4130 1324.9471 1335.7778 1341.8245 1350.4263 1374.9243 1386.1534 1396.6299 1398.6944 1399.9779 1401.9291 1408.8396 1411.6646 1432.4528 1444.9084 1449.4352 1465.4016 1468.2021 1469.3348 1482.4886 1491.2264 1505.5710 1512.5401 1519.4974 1525.7776 1548.8031 1563.3391 1572.3566 1582.0530 1588.7092 1618.0738 1626.6955 1629.6130 2999.6819 2999.8955 3032.5005 3038.1737 3080.2610 3089.4220 3096.3129 3099.8893 3100.3092 3108.2330 3110.8676 3138.4976 3138.5085 3142.6990 3149.2518 3150.5086 3152.0742 3165.8059 3172.3370 3172.8540 3174.4968 3181.3036 3189.7289 3195.4575 3215.3289
redmass: 4.5355 5.4970 5.4097 4.6224 3.7669 3.1870 3.8444 4.1342 4.1187 5.6348 3.8292 3.5627 3.8316 3.5102 1.1823 1.8277 1.4038 2.4448 3.9081 4.2970 4.7106 4.1330 4.4185 3.5839 3.3220 6.3378 3.5412 4.2180 3.2042 4.1139 3.5119 4.4141 4.3196 4.9053 4.1827 5.3533 4.0058 4.1850 4.6115 3.9375 3.2655 5.3609 4.8444 4.8186 6.7106 3.2446 5.6956 4.9564 4.8149 3.2594 1.2924 2.2806 1.4983 2.8459 3.1527 1.5700 1.9295 2.2231 1.3703 1.4537 1.5009 2.6377 1.6774 2.0534 4.1185 1.8220 3.0694 1.5109 1.9077 1.2867 1.3335 1.2873 1.4152 2.0241 1.7807 1.3776 3.7861 3.1169 3.2097 2.1674 2.7203 1.9947 1.9424 1.8152 1.8801 2.2134 1.2810 1.6179 1.2367 1.1849 1.5098 2.2445 1.9939 1.7837 1.8684 2.4866 1.4338 1.6788 1.6159 1.3770 2.2000 1.7546 1.4878 1.6650 1.3747 1.5390 2.2697 3.0535 2.2111 3.4218 1.4314 1.3422 4.3963 3.4670 2.5524 2.0599 2.3808 1.9955 1.0969 1.0666 1.0662 1.0567 1.1488 1.5713 3.5832 1.8782 4.9101 5.6371 7.4440 4.0277 5.8215 6.0686 6.4333 6.5150 1.0365 1.0362 1.0613 1.0662 1.1030 1.0984 1.0896 1.0992 1.0996 1.1026 1.1008 1.0886 1.0882 1.0876 1.0897 1.0900 1.0869 1.0902 1.0887 1.0988 1.0981 1.0940 1.0984 1.0970 1.0914
irintensity: 0.3835 0.4919 0.2152 0.1679 0.6157 0.0277 0.0312 0.3809 0.4638 1.5518 0.0503 0.3086 0.7425 1.3037 0.3371 0.2408 1.6479 5.0538 1.0208 2.3966 0.1777 1.6228 0.5871 0.9080 2.5467 1.7386 1.5391 4.7181 3.3154 6.7027 2.5725 9.2970 0.0689 14.2917 4.5910 5.2677 7.1805 16.2439 11.5866 6.5389 2.8998 0.6394 2.4695 14.9781 1.0172 1.1790 8.5368 10.5153 1.8177 57.7359 31.9058 20.5385 62.8761 16.2827 19.4236 1.3018 2.0468 7.2776 30.4393 26.1860 34.6632 6.9767 2.6118 14.7542 29.7484 16.6413 0.5745 28.8707 12.4946 12.8885 0.2318 19.4093 2.7745 0.6747 1.0285 0.9418 46.5961 10.8322 4.8906 7.6844 4.4023 34.6116 17.2917 59.5600 54.7885 24.1934 6.2545 70.2645 5.0254 2.0117 77.2111 21.5515 463.3902 3.6504 5.4625 2.7839 5.9444 79.3525 118.8966 291.2448 278.4455 16.7693 333.0800 71.1054 31.1942 4.7787 9.4649 11.5284 258.2142 41.9807 56.1218 18.8983 60.0164 244.8103 6.3668 28.5347 202.1719 73.6385 19.4691 2.4923 10.7122 15.7587 46.2789 16.5994 104.3236 43.5343 381.7578 996.1595 60.2769 1677.0952 508.2043 14.1710 17.8670 126.9935 10.3657 16.5523 39.3196 17.0447 0.3229 6.3557 4.2960 19.0266 36.9734 21.8938 12.8429 0.7376 3.7451 8.5967 0.8242 7.1058 0.5248 2.1305 0.8614 21.8132 11.8496 11.8023 18.8024 3.1917 7.9039
temp: 298.150 k
press: 1.00000 atm
elementType: 16 7 7 6 6 6 6 6 6 6 6 6 6 6 6 6 6 6 6 6 6 6 6 6 6 6 6 6 6 6 1 1 1 1 1 1 1 1 1 1 1 1 1 1 1 1 1 1 1 1 1 1 1 1 1
symmnumber: 1
zpe: 1172430.2 jmol-1
zpe.correction: 0.446555 hartree
zpe.thermalcorrener: 0.472715 hartree
zpe.thermalcorrenthalpy: 0.473659 hartree
zpe.thermalcorrgfe: 0.388351 hartree
zpe.sumelectzpe: -1549.166464 hartree
zpe.sumelectthermal: -1549.140304 hartree
zpe.sumelectthermalent: -1549.139360 hartree
zpe.sumelectthermalfe: -1549.224668 hartree
dipole: -5.5139 -0.0436 -0.3863
dipole: 5.5276
quadrupole: 4.2134 -134.6797 -191.3068
quadrupole: 14.3339 0.4423 0.7105
quadrupole: 111.4711 -27.4220 -84.0491 14.3339 0.4423 0.7105
hfenergy: -1549.6130189 hartree
pointgroup: C01 [X(C27H25N2S1)]
dipole: 2.1628736 -0.1076045 0.1995077 debye
polarizability: 1072.5317563|6.4817264|217.6024308|54.6090027|104.5641515|279.4452718 unknown
InChI: InChI=1S/C27H25N2S/c1-3-28-19-18-21(22-12-7-8-14-24(22)28)11-9-15-26-29(4-2)27-23-13-6-5-10-20(23)16-17-25(27)30-26/h5-19H,3-4H2,1-2H3
charge 1 multiplicity 1
55 atoms
S  -1.715408 -0.924294 -1.720492
N  -2.918896 0.296672 0.294559
N  6.004071 -0.813421 -0.670898
C  -3.996354 -0.138085 -0.539608
C  -5.422795 0.071388 -0.378567
C  -3.524132 -0.869211 -1.651406
C  -1.641929 0.014659 -0.175422
C  -3.072797 0.881376 1.659374
C  -6.28937 -0.604265 -1.33677
C  -4.370404 -1.4968 -2.597703
C  5.88701 0.108661 0.393865
C  -5.744936 -1.378891 -2.415282
C  4.574534 0.528651 0.830856
C  -6.054621 0.909084 0.602772
C  3.366073 0.01299 0.168137
C  -0.428973 0.381062 0.440153
C  -3.02463 2.422076 1.675026
C  -7.711467 -0.471792 -1.222575
C  7.336378 -1.256935 -1.185242
C  4.868627 -1.282588 -1.293675
C  3.591566 -0.903391 -0.912985
C  2.053605 0.397024 0.581827
C  0.849066 -0.013653 -0.014879
C  -7.446137 1.025157 0.676607
C  7.05274 0.618036 1.036073
C  4.51002 1.456102 1.915728
C  -8.289413 0.317035 -0.228499
C  6.940591 1.523244 2.098409
C  5.660104 1.947519 2.542813
C  7.974722 -0.240776 -2.153122
H  -2.264609 0.463467 2.28376
H  -4.011574 0.494873 2.082441
H  -3.953453 -2.0626 -3.434987
H  -6.434093 -1.865748 -3.112878
H  -5.466947 1.509559 1.295501
H  -0.473823 1.032626 1.319363
H  -2.058835 2.799299 1.297546
H  -3.819422 2.866323 1.052368
H  -3.15375 2.786121 2.709665
H  -8.34214 -0.998384 -1.947461
H  7.995414 -1.46476 -0.325832
H  7.177704 -2.220268 -1.699072
H  5.030517 -1.987306 -2.112811
H  2.757158 -1.342625 -1.46188
H  1.959112 1.071756 1.439088
H  0.890391 -0.678871 -0.889396
H  -7.891284 1.679114 1.433491
H  8.048002 0.311921 0.708303
H  3.536677 1.800107 2.272739
H  -9.376924 0.410613 -0.153239
H  7.84504 1.904368 2.582639
H  5.57417 2.657243 3.370895
H  7.332936 -0.07789 -3.036134
H  8.946989 -0.62771 -2.50534
H  8.149801 0.736238 -1.672141
