program: Gaussian 09
title: 000002370
version: EM64L-G09RevD.01
frameworkgroup: C1[X(C7H17N2O2)]
method: RPBEPBE
basis: SDD
operation: Freq
keyword: #p
keyword: freq=noraman
keyword: PBEPBE/SDD
title: #p freq=noraman PBEPBE/SDD
converged: YES YES NO NO
title: Mulliken charges:
elementType: O O N N C C C C C C C H H H H H H H H H H H H H H H H H
charge: -0.298169 -0.306592 -0.108204 -0.587879 -0.330756 -0.018548 -0.587727 -0.543468 -0.555230 -0.671196 0.293796 0.276432 0.257622 0.265839 0.258157 0.256415 0.327404 0.268691 0.265694 0.266626 0.260068 0.303013 0.255252 0.235563 0.261612 0.224208 0.362583 0.368798
chargesum: 1.00000
title: Mulliken charges with hydrogens summed into heavy atoms:
elementType: O O N N C C C C C C C
charge: -0.298169 -0.306592 -0.108204 0.143502 0.203297 0.247292 0.254248 0.257542 0.263102 0.050187 0.293796
polarizability: 1.06904435e+02 -3.49238100e+00 9.40600332e+01 -6.23589263e+00 -1.63177558e+00 8.05008778e+01
1716.lowfreq: -10.6723 -0.0008 -0.0007 -0.0006 8.7775 9.9890 66.1360 71.2274 92.3207
frequency: 66.0529 71.1997 92.3079 121.0809 177.6853 192.1909 212.1961 221.7703 263.7180 271.1054 297.7864 318.8907 353.3686 385.0542 409.3373 428.8427 461.8045 478.4369 528.4454 549.4577 608.0675 615.2197 701.1385 729.2297 760.0917 858.0473 885.6506 925.1263 936.7125 944.7472 972.6555 1045.7921 1054.2580 1064.7844 1089.1236 1115.9377 1123.8351 1152.1974 1204.6864 1224.3225 1253.6779 1272.9510 1308.9630 1321.5864 1369.1585 1371.9042 1402.1496 1421.7375 1427.7097 1434.2675 1452.7726 1461.9759 1463.5495 1468.5865 1473.2500 1477.8458 1486.9776 1495.7655 1517.2696 1595.6276 1688.1616 3001.6105 3010.3079 3022.9057 3024.9492 3031.8325 3040.9739 3095.7352 3103.9930 3116.7169 3130.0864 3135.7463 3139.8900 3142.9511 3147.0132 3171.1070 3539.5330 3688.5569
redmass: 4.1956 3.0531 5.4784 2.5314 3.3749 1.2969 1.3341 1.8561 3.0254 1.2477 1.7290 1.2616 2.0258 2.7233 3.0607 2.1189 2.6467 2.5388 2.7734 1.0548 1.4839 3.0175 7.8193 3.9220 3.4595 2.8506 2.0914 2.7498 2.6080 2.1195 3.0335 1.9608 1.2006 1.9835 1.4563 1.5603 1.8981 1.9238 1.4866 1.7273 1.8437 1.3940 1.4025 2.0636 1.4787 1.2895 1.1975 1.1452 1.1462 1.0867 1.0518 1.0659 1.0936 1.0760 1.0457 1.0487 1.0528 1.0526 1.0521 1.2312 6.2330 1.0368 1.0326 1.0443 1.0459 1.0344 1.0847 1.1043 1.1024 1.1001 1.1064 1.1054 1.1054 1.1053 1.1050 1.1050 1.0456 1.1060
irintensity: 5.6131 3.3424 2.7038 9.7378 8.1927 3.9450 3.4804 6.8264 2.7017 0.1994 3.3632 1.6814 0.1824 1.6732 3.0284 0.0293 1.3740 8.2779 4.7022 0.2463 200.3271 94.3231 49.7631 0.2563 14.8354 23.9228 8.8158 57.8093 12.2663 40.2162 111.3492 51.4751 0.1323 4.4019 7.5417 3.9331 19.1158 22.0607 1.6315 4.8460 2.6135 64.6010 5.7924 226.1623 39.3381 6.6643 18.1210 13.4363 14.7411 5.6488 1.3855 3.4108 18.0993 26.5505 9.0351 23.2797 29.0111 24.5262 67.5636 55.9705 461.2127 5.9849 20.3943 1.0559 8.9704 16.0246 3.6731 1.8078 15.9251 8.8294 9.3281 3.3694 0.8601 4.8740 7.8794 7.0141 127.3189 75.2453
temp: 298.150 k
press: 1.00000 atm
elementType: 8 8 7 7 6 6 6 6 6 6 6 1 1 1 1 1 1 1 1 1 1 1 1 1 1 1 1 1
symmnumber: 1
zpe: 649704.7 jmol-1
zpe.correction: 0.247459 hartree
zpe.thermalcorrener: 0.260739 hartree
zpe.thermalcorrenthalpy: 0.261684 hartree
zpe.thermalcorrgfe: 0.208857 hartree
zpe.sumelectzpe: -535.750328 hartree
zpe.sumelectthermal: -535.737048 hartree
zpe.sumelectthermalent: -535.736104 hartree
zpe.sumelectthermalfe: -535.788931 hartree
dipole: -4.2627 0.1891 -1.9233
dipole: 4.6803
quadrupole: -28.5985 -55.2577 -62.3226
quadrupole: -0.8526 -4.4547 4.3134
quadrupole: 20.1278 -6.5314 -13.5963 -0.8526 -4.4547 4.3134
hfenergy: -535.9977879 hartree
pointgroup: C01 [X(C7H17N2O2)]
dipole: 1.7233796 -0.008288 -0.6485409 debye
polarizability: 105.2745095|-6.3672625|93.1939759|6.8392481|4.0483262|82.9968607 unknown
InChI: InChI=1S/C7H17N2O2/c1-6(11-7(8)10)5-9(2,3)4/h6H,5,8H2,1-4H3
charge 1 multiplicity 1
28 atoms
O  -1.314945 -0.133688 -0.771308
O  -1.38299 1.10342 1.235516
N  1.858573 0.256867 0.063457
N  -2.948465 1.43565 -0.484523
C  1.051085 -0.903945 -0.581847
C  -0.406776 -1.132035 -0.139677
C  1.735078 0.239729 1.590503
C  3.324677 0.048125 -0.325705
C  1.408578 1.623745 -0.460546
C  -0.871683 -2.514118 -0.628522
C  -1.874496 0.838498 0.103395
H  1.083575 -0.735737 -1.672603
H  1.623339 -1.819718 -0.350658
H  -0.518168 -1.053606 0.956368
H  1.988387 -0.766574 1.95931
H  2.444715 0.974685 2.001647
H  0.705647 0.51671 1.867295
H  3.406649 0.022629 -1.423342
H  3.922315 0.881959 0.07244
H  3.682765 -0.901591 0.099982
H  1.397247 1.601953 -1.560323
H  0.412078 1.847715 -0.06086
H  2.124452 2.382229 -0.106433
H  -0.757957 -2.615377 -1.721754
H  -1.937243 -2.649241 -0.383203
H  -0.302066 -3.321077 -0.134386
H  -3.300718 1.108692 -1.382893
H  -3.434054 2.178999 0.014569
