program: Gaussian 09
title: 000111437
version: EM64L-G09RevD.01
frameworkgroup: C1[X(C11H12O4)]
method: RPBEPBE
basis: SDD
operation: Freq
keyword: #pfreq=noraman
keyword: PBEPBE/SDD
title: #p freq=noraman PBEPBE/SDD
converged: YES YES NO NO
title: Mulliken charges:
elementType: O O O O C C C C C C C C C C C H H H H H H H H H H H H
charge: -0.280974 -0.257498 -0.242499 -0.443990 -0.211328 -0.228996 0.307065 0.286049 0.140570 -0.326381 -0.387033 -0.254417 -0.202485 -0.222116 -0.672366 0.282108 0.264934 0.267601 0.219718 0.231215 0.229963 0.231114 0.230188 0.361531 0.211462 0.229740 0.236822
chargesum: 0.00000
title: Mulliken charges with hydrogens summed into heavy atoms:
elementType: O O O O C C C C C C C C C C C
charge: -0.280974 -0.257498 -0.242499 -0.082459 0.070780 0.035938 0.307065 0.286049 0.140570 -0.058779 -0.167315 -0.023202 0.027479 0.239187 0.005658
polarizability: 1.86464635e+02 -2.61758416e+00 1.26921391e+02 -1.15239908e+00 5.29035228e+00 8.66270447e+01
1716.lowfreq: -9.3171 -2.9472 0.0008 0.0009 0.0010 2.9177 20.4141 33.0473 56.0515
frequency: 20.3012 32.9698 56.0488 63.1372 88.5546 111.6154 147.9562 188.4345 221.5050 242.0810 268.2617 282.9459 341.0830 351.9945 359.8430 442.1284 473.3186 484.8650 514.0837 547.2613 591.9249 641.3395 678.0554 730.9676 757.3112 763.3658 784.3064 798.8954 804.3477 818.8677 846.8745 855.5218 926.1807 945.0877 980.5827 1025.1883 1035.0580 1061.3586 1070.6688 1089.9547 1113.4298 1134.3257 1147.7488 1162.3450 1171.3949 1211.4011 1236.5253 1249.2263 1251.5843 1282.0773 1305.4467 1358.2184 1378.3340 1397.9535 1402.3054 1439.6742 1462.4428 1473.1411 1486.1263 1494.1358 1603.3294 1617.6301 1622.5021 2997.2550 3010.7426 3070.2386 3093.5251 3110.1013 3115.4525 3130.9525 3137.1739 3138.9170 3150.3509 3169.9596 3588.5657
redmass: 4.7098 4.1354 5.8022 2.5365 4.1037 4.6121 3.1562 4.9112 2.8538 1.8864 3.5560 4.9422 3.4237 1.2357 4.0127 5.5163 3.5485 5.1254 7.5439 3.7380 6.9879 5.2585 6.4758 3.6843 1.3673 6.6617 5.2825 1.1203 4.6733 5.5643 1.9251 2.8664 3.7116 1.4503 1.3159 2.5142 2.0523 1.4603 1.9752 1.2631 2.2281 1.4589 1.3796 2.2953 1.0981 1.8562 3.1621 1.1384 2.0906 1.4181 1.3464 1.4282 2.9699 5.1393 1.2860 2.4259 1.0398 1.0631 1.0679 2.7851 6.5899 6.9548 9.9829 1.0360 1.0582 1.1068 1.0984 1.1025 1.0887 1.0922 1.0877 1.0874 1.0936 1.1003 1.0661
irintensity: 0.3245 1.3059 0.8841 1.5406 0.9042 0.3243 2.1527 0.7239 2.9376 2.8407 11.2006 13.7814 22.6947 118.8134 3.8149 0.8877 16.2127 8.4432 8.0413 1.0921 9.3597 2.0309 22.2722 6.2598 93.7977 6.5359 9.6962 1.8756 12.7967 28.4040 5.0915 5.8168 60.8394 12.7275 0.9802 103.1887 4.5505 9.7453 77.5108 49.4942 3.6767 5.1067 31.0806 45.0776 2.4776 78.5090 259.1768 0.1207 34.0746 57.8734 29.0077 1.4011 32.0880 10.6563 18.7388 42.4911 12.3193 4.3083 14.5870 23.1571 24.8661 27.6800 216.8294 19.0806 20.0717 8.0192 30.8560 39.1675 12.4616 3.0053 7.3541 4.0639 11.2040 22.1308 34.2822
temp: 298.150 k
press: 1.00000 atm
elementType: 8 8 8 8 6 6 6 6 6 6 6 6 6 6 6 1 1 1 1 1 1 1 1 1 1 1 1
symmnumber: 1
zpe: 545250.6 jmol-1
zpe.correction: 0.207675 hartree
zpe.thermalcorrener: 0.222454 hartree
zpe.thermalcorrenthalpy: 0.223398 hartree
zpe.thermalcorrgfe: 0.163662 hartree
zpe.sumelectzpe: -726.107677 hartree
zpe.sumelectthermal: -726.092898 hartree
zpe.sumelectthermalent: -726.091954 hartree
zpe.sumelectthermalfe: -726.151690 hartree
dipole: 1.7310 3.4750 0.2970
dipole: 3.8936
quadrupole: -66.0351 -78.8773 -96.4395
quadrupole: -2.1732 6.7970 4.4339
quadrupole: 14.4156 1.5733 -15.9889 -2.1732 6.7970 4.4339
hfenergy: -726.3153515 hartree
pointgroup: C01 [X(C11H12O4)]
dipole: -0.6701188 -1.3691646 0.1515039 debye
polarizability: 186.5000499|-2.3794391|126.7252607|-0.8698542|-5.8381201|86.78776 unknown
InChI: InChI=1S/C11H12O4/c1-2-14-11(13)10-9(15-10)7-5-3-4-6-8(7)12/h3-6,9-10,12H,2H2,1H3
charge 0 multiplicity 1
27 atoms
O  0.474014 1.122374 -1.230709
O  2.841057 -0.225811 -0.272035
O  2.807484 1.167744 1.602698
O  -1.258573 -2.395575 0.483195
C  -0.054225 -0.065811 -0.473626
C  0.814145 0.962085 0.228382
C  -1.528236 -0.117603 -0.24699
C  2.239327 0.671192 0.59957
C  -2.126015 -1.313757 0.23246
C  -2.362177 0.995547 -0.507533
C  -3.52054 -1.394337 0.448795
C  -3.756096 0.928306 -0.292844
C  -4.333854 -0.269618 0.187179
C  4.27282 -0.558412 0.015101
C  4.723244 -1.526616 -1.072522
H  0.439979 -1.007496 -0.736687
H  0.332064 1.690785 0.890532
H  -1.897392 1.902503 -0.909634
H  -3.968022 -2.325278 0.8210
H  -4.386923 1.797299 -0.505063
H  -5.414281 -0.333784 0.355253
H  4.850697 0.383369 0.013828
H  4.328629 -0.996783 1.028072
H  -1.763442 -3.18959 0.787525
H  5.781822 -1.801395 -0.9122
H  4.11832 -2.449222 -1.055507
H  4.629575 -1.067117 -2.070941
