program: Gaussian 09
title: 000111420
version: EM64L-G09RevD.01
frameworkgroup: C1[X(C11H25O2PS2)]
method: RPBEPBE
basis: SDD
operation: Freq
keyword: #p
keyword: freq=noraman
keyword: PBEPBE/SDD
title: #p freq=noraman PBEPBE/SDD
converged: YES YES NO NO
title: Mulliken charges:
elementType: S S P O O C C C C C C C C C C C H H H H H H H H H H H H H H H H H H H H H H H H H
charge: -0.171827 -0.211616 0.599813 -0.493856 -0.463811 -0.001593 -0.424447 -0.401193 -0.362136 -0.325908 -0.354923 -0.722269 -0.696436 0.050984 -0.663538 -0.660812 0.211665 0.188117 0.201689 0.206537 0.222435 0.189782 0.204165 0.232666 0.231615 0.194527 0.196667 0.214916 0.217559 0.234575 0.217225 0.210664 0.210117 0.224203 0.225363 0.258403 0.204551 0.230139 0.234031 0.205372 0.136584
chargesum: 0.00000
title: Mulliken charges with hydrogens summed into heavy atoms:
elementType: S S P O O C C C C C C C C C C C
charge: -0.035243 -0.211616 0.599813 -0.493856 -0.463811 0.210072 -0.034642 0.027779 0.031810 0.138373 0.036272 -0.055220 -0.058429 0.275187 0.024780 0.008731
polarizability: 2.15537764e+02 -8.63095856e-01 1.84737132e+02 -6.93368439e+00 -8.49508817e+00 1.82424593e+02
1716.lowfreq: -10.7851 -5.9116 -0.0022 -0.0018 -0.0006 7.0545 17.2936 21.1566 25.6211
frequency: 15.6612 20.8982 25.6138 33.5918 49.3806 61.8548 69.0551 83.5675 89.9530 110.0957 115.2338 129.0370 142.9713 163.6570 177.6148 182.8104 200.1676 220.5830 227.9777 232.8552 242.0246 257.0985 277.3343 283.7549 304.8586 325.0039 353.1166 369.9815 405.5929 437.2377 449.4358 490.2490 530.8335 580.8392 665.1064 686.0930 728.8908 746.7374 760.6449 770.6307 805.2984 838.9884 887.2873 898.7542 912.3331 926.4509 927.7296 935.0099 966.8322 973.9789 995.5437 1026.2026 1038.9058 1078.2904 1090.0540 1091.7618 1129.9940 1151.6397 1152.9111 1161.3357 1182.4713 1205.8650 1215.7635 1249.0998 1265.8634 1280.1059 1287.1667 1296.0703 1316.8242 1329.7656 1331.5237 1342.7122 1353.9657 1357.8911 1370.7525 1377.9572 1388.7656 1393.0566 1399.6323 1451.2386 1461.1975 1463.9086 1466.5354 1467.2617 1472.5296 1475.0805 1476.9685 1480.5683 1485.8055 1487.2303 1490.4993 1496.4724 2438.0780 2955.0723 2959.1408 2964.0332 2968.7536 2972.1392 2978.3129 2983.2483 2988.4953 2992.8480 2993.6060 2997.2006 2998.8195 3009.7004 3035.7070 3038.4260 3050.8636 3068.3508 3071.7351 3071.9227 3075.2993 3084.2325 3092.5581 3104.9365 3109.9027
redmass: 3.8337 3.4023 4.1732 2.7033 3.5551 4.0129 1.7312 4.1915 4.2301 3.0381 4.3290 2.8609 3.2462 1.7757 1.6488 1.0272 3.1859 1.2356 1.1330 4.0680 1.6173 3.6219 3.4320 2.4019 2.3998 3.5280 4.0902 5.2298 3.8076 2.7230 3.8613 2.8199 2.1840 7.7496 4.0481 2.2638 1.1011 1.9344 1.4991 1.4993 1.3863 6.7952 1.8513 2.9320 1.3576 1.7633 2.2399 1.3231 1.7902 2.2078 1.6785 1.3982 2.6245 2.4255 1.6014 2.0477 1.7999 2.1728 2.0379 2.3421 1.9663 1.3404 1.2656 1.2543 1.2311 1.1307 1.0716 1.2545 1.3571 1.4458 1.2858 1.5446 1.5283 1.3372 1.3331 1.2519 1.2154 1.2204 1.2177 1.0497 1.0695 1.0475 1.0717 1.0498 1.0675 1.0656 1.0428 1.0710 1.0672 1.0491 1.0732 1.0555 1.0380 1.0588 1.0595 1.0802 1.0604 1.0362 1.0383 1.0548 1.0359 1.0373 1.0795 1.0845 1.0793 1.1010 1.1038 1.1004 1.1080 1.1007 1.0989 1.0990 1.1004 1.0985 1.0986 1.1010 1.1009
irintensity: 0.4534 0.3221 0.1844 0.1448 1.0333 0.0257 0.0477 1.3406 1.1015 0.4940 2.8734 1.2905 3.0054 4.9740 17.8190 0.0546 0.2697 0.7690 0.0468 3.3575 0.3888 1.0575 0.7004 1.7062 0.2283 3.8127 11.7922 34.8813 18.1904 5.3469 32.1238 6.3792 9.8957 68.6154 27.7459 70.7885 8.5544 72.1187 7.1713 14.4556 5.6786 267.5618 32.1900 82.3268 6.7468 88.3041 70.8034 2.0891 0.5973 12.5264 26.7734 2.2146 0.6810 2.8811 71.8251 16.8365 1.6246 1.5853 10.1945 0.9918 18.7631 0.6098 1.7217 3.6556 0.8962 3.0597 1.1872 0.8800 9.6557 0.3359 15.3182 3.6579 0.1135 0.5921 0.9756 29.2050 11.9587 23.2733 19.5500 4.4556 1.4435 7.3571 1.1588 4.1370 2.3258 1.9330 12.4006 21.4185 19.8624 13.6253 5.5588 11.1453 6.7094 5.1109 2.3040 8.8150 75.0622 40.9558 17.1432 48.1846 13.8488 27.2781 8.5098 7.1691 37.6400 4.3153 47.4994 19.2528 39.6378 88.7968 94.6828 4.6731 54.8598 6.0047 40.3456 15.6594 23.8263
temp: 298.150 k
press: 1.00000 atm
elementType: 16 16 15 8 8 6 6 6 6 6 6 6 6 6 6 6 1 1 1 1 1 1 1 1 1 1 1 1 1 1 1 1 1 1 1 1 1 1 1 1 1
symmnumber: 1
zpe: 903965.8 jmol-1
zpe.correction: 0.344302 hartree
zpe.thermalcorrener: 0.367854 hartree
zpe.thermalcorrenthalpy: 0.368798 hartree
zpe.thermalcorrgfe: 0.287543 hartree
zpe.sumelectzpe: -1720.624365 hartree
zpe.sumelectthermal: -1720.600813 hartree
zpe.sumelectthermalent: -1720.599869 hartree
zpe.sumelectthermalfe: -1720.681124 hartree
dipole: -1.1983 2.2387 -1.9751
dipole: 3.2170
quadrupole: -116.9005 -122.1729 -129.1535
quadrupole: 6.4602 -5.8172 3.1253
quadrupole: 5.8418 0.5694 -6.4112 6.4602 -5.8172 3.1253
hfenergy: -1720.9686669 hartree
pointgroup: C01 [X(C11H25O2P1S2)]
dipole: 0.4562728 0.9917178 0.6404583 debye
polarizability: 215.5598572|0.231248|187.1502432|-7.0374705|7.6953919|179.9893882 unknown
InChI: InChI=1S/C11H24O2PS.HS/c1-5-7-8-11(6-2)9-12-14(15)13-10(3)4;/h10-11H,5-9H2,1-4H3;1H
charge 0 multiplicity 1
41 atoms
S  -2.912986 -1.139059 2.332482
S  -2.300953 -2.744908 -1.00139
P  -2.376612 -0.99069 0.06382
O  -0.935638 -0.032817 0.214972
O  -3.456293 0.168119 -0.592542
C  1.500086 0.18342 0.103842
C  2.832451 -0.452066 0.594789
C  1.454103 0.466437 -1.423895
C  4.088121 0.396381 0.291861
C  0.343071 -0.718959 0.562085
C  5.372182 -0.193244 0.919517
C  1.633778 -0.769197 -2.334724
C  6.633229 0.637369 0.597851
C  -3.626033 1.533426 0.04481
C  -2.75724 2.533706 -0.725869
C  -5.128412 1.816169 -0.028886
H  1.381721 1.157538 0.624796
H  2.769642 -0.608546 1.69252
H  2.957527 -1.459348 0.146612
H  2.23345 1.214938 -1.664855
H  0.48287 0.944461 -1.653329
H  3.936978 1.429329 0.669815
H  4.231972 0.481772 -0.803793
H  0.363048 -0.868612 1.658288
H  0.37436 -1.705313 0.058867
H  5.242967 -0.262385 2.019046
H  5.509957 -1.232642 0.557244
H  2.604309 -1.271571 -2.165751
H  1.598061 -0.468302 -3.397632
H  0.831297 -1.513986 -2.181684
H  7.536752 0.196776 1.057834
H  6.803143 0.69338 -0.494045
H  6.532979 1.672958 0.974386
H  -3.297297 1.459877 1.101033
H  -3.054354 2.560194 -1.788792
H  -1.692755 2.25583 -0.657835
H  -2.888572 3.546626 -0.301157
H  -5.469728 1.797565 -1.078413
H  -5.697737 1.062236 0.539906
H  -5.343864 2.815389 0.392622
H  -3.771379 -2.210249 2.136896
