program: Gaussian 09
title: 000111334
version: EM64L-G09RevD.01
frameworkgroup: C1[X(C19H14IN5O2)]
method: RPBEPBE
basis: SDD
operation: Freq
keyword: #p
keyword: freq=noraman
keyword: PBEPBE/SDD
title: #p freq=noraman PBEPBE/SDD
converged: YES YES NO NO
title: Mulliken charges:
elementType: I O O N N N N N C C C C C C C C C C C C C C C C C C C H H H H H H H H H H H H H H
charge: 0.140295 -0.222322 -0.219535 -0.399295 -0.054293 -0.165553 0.018990 -0.113760 0.494274 0.298686 -0.397570 -0.340721 -0.011090 0.388101 -0.338289 -0.334984 -0.346798 -0.315365 -0.230698 -0.246072 -0.229453 0.193054 -0.327394 -0.273510 -0.130551 -0.126290 -0.369661 0.236788 0.284267 0.287708 0.287686 0.321936 0.254849 0.268360 0.229456 0.228127 0.231861 0.264544 0.254002 0.257206 0.253013
chargesum: 0.00000
title: Mulliken charges with hydrogens summed into heavy atoms:
elementType: I O O N N N N N C C C C C C C C C C C C C C C C C C C
charge: 0.140295 -0.222322 -0.219535 -0.077359 -0.054293 -0.165553 0.018990 -0.113760 0.494274 0.298686 -0.160782 -0.056453 -0.011090 0.388101 -0.050582 -0.047298 -0.091949 -0.047005 -0.001242 -0.017945 0.002407 0.193054 -0.062849 -0.019507 0.126655 0.126723 -0.369661
polarizability: 7.49867263e+02 6.86535521e+01 4.53266580e+02 2.42797983e+00 -3.60059958e+00 1.03914775e+02
1716.lowfreq: -2.9962 -0.0005 -0.0003 0.0002 0.8391 1.8147 15.0134 19.7381 23.2054
frequency: 14.8400 19.7296 23.2042 30.0646 35.0964 45.8093 56.6209 77.0457 95.8768 102.3318 128.7940 155.2028 167.9365 176.9770 216.1148 228.3146 243.2650 268.1957 284.8510 304.5950 322.3728 335.9282 381.8912 399.7157 409.7980 418.0831 436.9246 463.8614 466.2460 498.3947 508.8479 512.2741 567.9684 609.2354 615.4800 622.4049 632.2509 654.6650 658.0865 664.1970 694.0629 696.8014 717.9237 734.5763 762.9218 779.1963 802.6667 814.7535 828.5740 843.3782 849.0025 849.3919 857.6886 864.4639 882.9777 930.8240 970.6269 978.1248 979.5412 981.1640 985.9126 989.0926 992.8850 998.9760 1001.2311 1020.7075 1044.2014 1061.0448 1084.5458 1095.3553 1104.2476 1109.2800 1139.4529 1168.1401 1173.1635 1174.6702 1193.6187 1212.2364 1220.2495 1256.8336 1275.9123 1286.4984 1295.3979 1323.4598 1340.3004 1351.8023 1363.4143 1377.9079 1399.4834 1402.3107 1428.2608 1437.0045 1447.1751 1453.0833 1475.2278 1485.4033 1505.9994 1553.6128 1580.7984 1581.9135 1588.1063 1609.4978 1611.4762 3128.1642 3137.2218 3139.7125 3154.8160 3156.0020 3156.3588 3168.6120 3174.2090 3176.3953 3178.1136 3185.6320 3193.3978 3194.8851 3339.5967
redmass: 7.6750 5.4878 5.7185 4.2736 6.1210 7.4250 6.5853 6.4423 7.2564 8.8748 9.0665 7.3412 7.9428 6.6457 7.2848 7.0772 8.1852 6.4417 6.1207 6.2201 5.5001 6.1477 7.7089 2.8312 3.0243 3.0039 6.4660 5.9075 4.5325 3.1637 3.8942 4.6696 6.8925 7.3386 6.4417 7.2764 7.6189 4.9760 7.0996 4.7189 2.1525 4.0846 3.4248 4.6876 7.7919 1.9841 7.2891 1.3004 1.2833 1.7356 1.4108 1.2529 3.6074 1.6126 4.2867 1.4371 1.3682 1.4223 1.3944 1.3376 3.9668 5.8908 2.9152 1.3296 1.3381 3.3918 2.5954 2.8906 1.6991 3.1552 1.3575 1.3539 2.1399 1.3963 1.5265 1.2049 1.1383 2.6830 4.5753 2.5761 2.5801 1.3044 1.3851 1.5203 4.4551 8.3477 6.0483 7.3067 4.9409 4.3842 3.3395 3.9421 2.9612 2.3623 2.4614 2.6868 3.1353 7.3216 6.5410 6.0757 7.2792 6.0373 6.4264 1.0852 1.0905 1.0897 1.0879 1.0947 1.0887 1.0985 1.0964 1.0889 1.0977 1.0947 1.0946 1.0968 1.0742
irintensity: 0.4563 0.0759 0.7764 0.5891 0.0482 0.6065 0.5064 0.1918 3.0457 2.3532 2.5238 0.8629 0.9242 0.5645 2.3478 3.1649 1.2728 4.4522 4.5470 2.4890 3.0355 7.8318 2.8360 0.4442 1.4828 0.3932 33.4499 14.0593 8.1358 30.9678 7.8800 11.5464 4.0527 1.5497 0.3091 11.4937 1.1238 18.5133 16.2714 20.2610 33.5187 21.8226 0.0582 3.0539 19.3870 41.0406 36.6369 5.2933 1.4136 39.6353 93.1216 7.2604 28.1007 74.5306 48.8505 4.4542 3.6377 6.3972 3.5946 0.7773 79.7244 0.3963 1.6168 0.4425 0.1304 58.6891 68.6134 143.4464 18.1829 35.2006 6.8791 20.9914 44.9095 384.9850 4.0338 6.7052 51.2066 344.1738 964.7054 309.5750 12.5835 0.1542 38.6602 15.3299 27.8537 75.4308 9.3456 8.0217 40.3744 68.6748 97.5664 27.3269 55.6266 54.6357 111.3844 75.2560 416.4255 31.9849 124.5219 2.1425 4.7051 8.1505 517.0682 0.5296 5.9839 14.3658 1.7290 32.6629 0.5059 22.6698 6.9779 0.2472 5.9617 1.0947 5.3346 0.8870 5.7493
temp: 298.150 k
press: 1.00000 atm
elementType: 53 8 8 7 7 7 7 7 6 6 6 6 6 6 6 6 6 6 6 6 6 6 6 6 6 6 6 1 1 1 1 1 1 1 1 1 1 1 1 1 1
symmnumber: 1
zpe: 773715.7 jmol-1
zpe.correction: 0.294693 hartree
zpe.thermalcorrener: 0.317982 hartree
zpe.thermalcorrenthalpy: 0.318926 hartree
zpe.thermalcorrgfe: 0.235930 hartree
zpe.sumelectzpe: -1166.124354 hartree
zpe.sumelectthermal: -1166.101066 hartree
zpe.sumelectthermalent: -1166.100121 hartree
zpe.sumelectthermalfe: -1166.183117 hartree
dipole: 6.7108 3.5093 -0.0917
dipole: 7.5735
quadrupole: -220.7596 -169.7196 -175.1489
quadrupole: -33.2247 2.1897 -0.8947
quadrupole: -32.2169 18.8231 13.3938 -33.2247 2.1897 -0.8947
hfenergy: -1166.4190471 hartree
pointgroup: C01 [X(C19H14I1N5O2)]
dipole: -2.951059 -0.0823369 0.4034308 debye
polarizability: 730.7676537|94.5564774|458.7669852|-67.9780926|36.0012601|117.5139785 unknown
InChI: InChI=1S/C19H14IN5O2/c20-15-6-8-16(9-7-15)21-23-19(14-4-2-1-3-5-14)24-22-17-10-12-18(13-11-17)25(26)27/h1-13,22H
charge 0 multiplicity 1
41 atoms
I  -5.738555 -5.709168 -0.037452
O  7.153752 -1.847804 -1.140954
O  7.43063 0.420228 -1.089697
N  1.122597 -0.01947 -0.1464
N  0.536897 1.193882 0.007626
N  -1.448667 -0.028168 0.103395
N  6.693549 -0.642506 -1.021702
N  -2.735193 -0.087038 0.375529
C  2.497763 -0.143115 -0.365354
C  -1.414204 2.55928 0.414002
C  3.047986 -1.451322 -0.50007
C  3.342323 1.001234 -0.451545
C  -0.80762 1.222532 0.176997
C  5.249659 -0.471401 -0.795739
C  4.423143 -1.617365 -0.71537
C  4.717068 0.834728 -0.665386
C  -0.58208 3.607283 0.905921
C  -2.780699 2.847824 0.139122
C  -1.097876 4.900657 1.114454
C  -3.289937 4.148509 0.344269
C  -2.456816 5.179733 0.833006
C  -3.315838 -1.382128 0.247758
C  -4.654755 -1.486707 0.715666
C  -2.679728 -2.52586 -0.3181
C  -5.347689 -2.711101 0.643948
C  -3.36769 -3.748607 -0.400121
C  -4.69736 -3.836823 0.086515
H  2.395439 -2.32947 -0.431948
H  2.898843 1.994364 -0.353844
H  4.87175 -2.608288 -0.821337
H  5.39077 1.692535 -0.737095
H  0.501937 -0.84728 -0.128152
H  0.468319 3.389133 1.121012
H  -3.437718 2.05594 -0.223478
H  -0.443511 5.690517 1.499537
H  -4.342945 4.354678 0.122565
H  -2.859304 6.185719 0.995591
H  -5.128838 -0.596175 1.140463
H  -1.658991 -2.437967 -0.70107
H  -6.374208 -2.785133 1.012778
H  -2.883005 -4.62458 -0.840939
