program: Gaussian 09
title: 000002356
version: EM64L-G09RevD.01
frameworkgroup: C1[X(C14H16O9)]
method: RPBEPBE
basis: SDD
operation: Freq
keyword: #pfreq=noraman
keyword: PBEPBE/SDD
title: #p freq=noraman PBEPBE/SDD
converged: YES YES NO NO
title: Mulliken charges:
elementType: O O O O O O O O O C C C C C C C C C C C C C C H H H H H H H H H H H H H H H H
charge: -0.270904 -0.291819 -0.424918 -0.444041 -0.427603 -0.421410 -0.220830 -0.326602 -0.449094 -0.098994 -0.228225 -0.164938 -0.147950 -0.052444 0.389643 -0.413622 0.186628 0.122778 -0.069998 -0.609121 0.040574 0.283508 -0.506003 0.268287 0.260206 0.231113 0.264219 0.196870 0.255882 0.219770 0.365466 0.377281 0.269742 0.335565 0.389117 0.375525 0.225096 0.276013 0.235235
chargesum: 0.00000
title: Mulliken charges with hydrogens summed into heavy atoms:
elementType: O O O O O O O O O C C C C C C C C C C C C C C
charge: -0.270904 -0.291819 -0.059452 -0.066759 -0.092038 -0.032293 -0.220830 -0.326602 -0.073569 0.169292 0.031981 0.066175 0.116269 0.144426 0.389643 0.062030 0.186628 0.122778 -0.069998 -0.339379 0.040574 0.283508 0.230340
polarizability: 2.51483103e+02 8.44525889e+00 1.89091698e+02 -1.09379153e+01 2.38482686e+01 1.28030968e+02
1716.lowfreq: -9.1150 -0.0007 -0.0005 -0.0003 2.1902 4.5092 31.1885 42.9694 63.2279
frequency: 31.1443 42.9590 63.2210 71.6538 86.6634 111.9048 124.6644 129.5532 153.4410 161.3332 169.6966 192.0520 199.8724 211.9974 218.2351 244.2133 260.1316 271.8318 301.0157 315.3396 316.8878 336.1976 344.9952 362.4053 391.7036 402.9953 415.7706 428.5108 450.8933 477.3643 485.6106 501.3715 527.3370 550.0366 569.4689 571.7786 576.7649 628.6016 634.6087 673.5619 690.4918 723.4333 751.4018 762.7647 792.2678 797.4179 837.2227 861.9493 868.3317 896.2338 911.6134 938.8094 950.9642 973.1015 984.0133 1007.9162 1019.3192 1032.8263 1047.5677 1051.9086 1093.0818 1108.2824 1116.8973 1122.4036 1154.3506 1170.8225 1174.3461 1203.3344 1220.4042 1233.0832 1237.8554 1241.4709 1248.2523 1269.8247 1282.1079 1297.0660 1311.0233 1326.4872 1336.4886 1347.2506 1347.4750 1360.4943 1379.5168 1384.2714 1396.2467 1402.6917 1432.1829 1454.9146 1463.8270 1474.9688 1479.8159 1499.1613 1606.3319 1618.9366 1651.4038 2910.2180 2979.8786 2994.7406 2999.7192 3020.0513 3031.3864 3071.2824 3109.5413 3112.3544 3137.1015 3147.2179 3460.2833 3475.4639 3509.8129 3559.7430 3585.0001
redmass: 6.0869 5.3454 3.7753 4.2262 3.4210 5.4636 2.4115 6.6852 5.9240 2.2329 5.4147 5.0985 3.6172 6.1538 3.9354 3.8395 6.0507 7.2204 5.6026 1.4740 2.6465 6.3650 4.6620 1.3472 4.3601 5.3572 5.1588 1.3165 5.3944 5.8317 2.5411 5.3834 1.8110 5.9923 1.3665 2.9696 6.1631 6.2773 5.0325 5.3273 4.8409 9.7049 5.3560 4.6718 5.3605 5.2274 4.9715 1.8171 3.5917 3.2448 3.9618 5.5969 2.7791 4.7873 4.3998 6.1669 4.5112 3.1248 2.7624 2.5610 1.7228 4.0525 1.4980 2.5148 1.3756 1.5143 1.4833 1.2985 1.4921 1.5995 1.4225 2.1333 1.2307 1.2455 1.4494 1.6231 1.3436 2.2320 1.4387 1.4599 1.8589 1.7960 1.3292 1.2066 1.1755 7.2141 1.3286 1.0737 1.0732 2.0644 1.3471 4.2655 7.9118 7.9385 11.3813 1.0822 1.0837 1.0331 1.0659 1.0843 1.0864 1.0866 1.0994 1.0994 1.0918 1.1061 1.0637 1.0652 1.0648 1.0665 1.0662
irintensity: 0.2633 1.9639 4.1986 2.6278 3.6712 0.9759 2.9334 1.6274 14.6189 3.4048 3.8323 9.5270 9.7259 0.1668 2.6337 7.7375 2.1119 11.6939 10.6001 133.9744 44.8743 16.0283 6.3410 107.9562 16.0875 9.9971 4.3927 68.2441 0.9861 6.9530 86.5809 23.1018 110.5370 11.3246 87.3064 66.3109 8.1607 3.6790 2.6458 15.0644 26.4837 16.2512 26.5993 16.8456 9.1149 25.8755 8.2299 18.3727 14.0017 16.5073 19.4350 205.7130 17.6431 75.3419 78.8346 119.8620 249.1309 126.2807 41.3624 105.0158 13.7243 170.3094 24.9925 67.0046 2.3904 46.1049 91.7561 49.9223 59.7524 26.2937 17.7414 139.5799 10.9863 15.9513 21.1758 78.9587 13.4401 166.4098 18.8958 16.0964 125.2870 60.0188 15.3115 24.5773 31.3370 59.1104 14.4942 15.5679 6.7865 92.2843 7.0464 26.2152 74.1974 133.4794 204.2304 59.1316 12.5616 67.4830 41.5373 11.8112 28.6653 21.3266 28.7864 5.6440 6.0823 7.9870 89.5777 57.7931 27.1119 9.6208 61.9985
temp: 298.150 k
press: 1.00000 atm
elementType: 8 8 8 8 8 8 8 8 8 6 6 6 6 6 6 6 6 6 6 6 6 6 6 1 1 1 1 1 1 1 1 1 1 1 1 1 1 1 1
symmnumber: 1
zpe: 768350.7 jmol-1
zpe.correction: 0.292649 hartree
zpe.thermalcorrener: 0.314560 hartree
zpe.thermalcorrenthalpy: 0.315505 hartree
zpe.thermalcorrgfe: 0.242625 hartree
zpe.sumelectzpe: -1218.322010 hartree
zpe.sumelectthermal: -1218.300099 hartree
zpe.sumelectthermalent: -1218.299155 hartree
zpe.sumelectthermalfe: -1218.372034 hartree
dipole: 8.0342 4.3742 1.4721
dipole: 9.2655
quadrupole: -129.4117 -130.4318 -138.3131
quadrupole: -7.4788 -13.5495 3.9337
quadrupole: 3.3072 2.2871 -5.5942 -7.4788 -13.5495 3.9337
hfenergy: -1218.6146595 hartree
pointgroup: C01 [X(C14H16O9)]
dipole: 3.130865 -1.7983358 -0.5020248 debye
polarizability: 250.170004|-10.9519901|189.0876287|15.2008103|23.8602896|129.3481376 unknown
InChI: InChI=1S/C14H16O9/c1-21-11-5(16)2-4-7(9(11)18)12-13(23-14(4)20)10(19)8(17)6(3-15)22-12/h2,6,8,10,12-13,15-19H,3H2,1H3
charge 0 multiplicity 1
39 atoms
O  -1.389018 -1.068535 0.383156
O  -1.375322 1.830438 -0.092857
O  -3.667008 1.795198 -1.8043
O  -3.796924 0.729874 0.839195
O  -4.596855 -2.864388 0.967089
O  1.53831 -2.242565 -1.246196
O  -0.029978 3.0532 1.296161
O  4.030589 -1.690917 -0.527483
O  4.667268 0.833857 0.796194
C  -1.452307 0.828416 -1.208804
C  -0.716349 -0.459197 -0.794547
C  -2.953303 0.570791 -1.480033
C  -3.61611 -0.182958 -0.297861
C  -2.78983 -1.440368 0.066422
C  0.697243 -0.131284 -0.399198
C  -3.337125 -2.181034 1.298241
C  0.970253 1.106112 0.242089
C  -0.126825 2.073105 0.529242
C  1.764577 -1.025699 -0.608311
C  2.277442 1.437747 0.661538
C  3.087008 -0.708937 -0.185102
C  3.341181 0.540323 0.437197
C  5.097011 -2.036626 0.444691
H  -0.982209 1.286359 -2.099329
H  -0.730284 -1.180716 -1.63791
H  -3.015386 -0.0527 -2.392415
H  -4.640649 -0.488721 -0.569759
H  -2.789219 -2.128148 -0.813318
H  -3.600312 -1.457503 2.08444
H  -2.565787 -2.881301 1.674698
H  -3.870299 2.246995 -0.941444
H  -2.905411 1.106164 1.077083
H  2.438463 2.401084 1.159919
H  -4.398611 -3.660131 0.41129
H  2.414391 -2.715334 -1.311609
H  4.726667 1.734236 1.201694
H  4.647351 -2.363057 1.400384
H  5.755296 -1.171521 0.610593
H  5.644072 -2.867159 -0.025041
