program: Gaussian 09
title: 000111277
version: EM64L-G09RevD.01
frameworkgroup: C1[X(C11H12O2)]
method: RPBEPBE
basis: SDD
operation: Freq
keyword: #pfreq=noraman
keyword: PBEPBE/SDD
title: #p freq=noraman PBEPBE/SDD
converged: YES YES NO NO
title: Mulliken charges:
elementType: O O C C C C C C C C C C C H H H H H H H H H H H H
charge: -0.271659 -0.251770 -0.272873 0.507358 -0.371895 -0.415505 -0.036865 -0.228164 -0.219212 -0.238788 0.304072 -0.574356 -0.752610 0.238721 0.242995 0.238319 0.235736 0.225363 0.227760 0.229777 0.219408 0.221870 0.249426 0.248144 0.244750
chargesum: 0.00000
title: Mulliken charges with hydrogens summed into heavy atoms:
elementType: O O C C C C C C C C C C C
charge: -0.271659 -0.251770 -0.034152 0.507358 -0.128900 -0.177187 0.198871 -0.002801 0.008548 -0.009011 0.304072 -0.133078 -0.010290
polarizability: 1.35824389e+02 -1.70677391e+01 1.12272209e+02 -1.86515011e+00 3.59108051e+00 1.17288432e+02
1716.lowfreq: -33.5508 -10.5052 -6.9097 0.0003 0.0006 0.0009 3.2695 20.7148 35.0292
frequency: -32.5641 20.2521 34.7251 61.1911 69.1381 125.8742 151.0234 219.9119 251.4852 301.0023 342.1823 393.8055 400.3871 448.4331 522.2655 560.5272 588.8437 614.2436 626.2682 673.0647 700.7210 767.2033 827.5730 844.8702 850.7197 891.4796 918.6375 951.3724 959.4967 972.9742 990.6760 991.8328 995.1055 997.5981 1026.7310 1041.8206 1077.8497 1155.6036 1173.5107 1187.1176 1197.3161 1213.3668 1266.6941 1286.9057 1290.2273 1343.1049 1379.8317 1388.2838 1430.4992 1446.4669 1452.1324 1454.8064 1482.6877 1595.4545 1612.5759 1646.2771 1658.7750 3005.9099 3048.6031 3092.2305 3098.1812 3117.5637 3123.6735 3129.0510 3140.0445 3140.9820 3150.1271 3165.4433 3201.9678
redmass: 1.0346 3.7943 7.6590 3.3332 3.4421 3.6946 3.1424 4.9405 2.7049 4.0281 4.0553 3.0514 2.7994 3.2907 3.1213 3.2582 3.7141 5.8481 4.8943 2.5320 1.6606 2.0200 3.3086 2.2442 1.7150 6.9773 1.4802 1.6927 1.3431 1.3939 4.2700 1.9214 1.2936 1.2491 2.1536 1.6531 1.6420 2.4225 1.0570 1.1722 2.8776 2.3791 1.3972 1.3004 1.3723 1.3080 1.2506 5.6947 1.2783 1.9344 1.0581 1.0529 2.3095 6.0468 6.1172 8.8770 4.9053 1.0375 1.0862 1.0603 1.0954 1.0940 1.0848 1.0878 1.0923 1.1019 1.0967 1.1017 1.1145
irintensity: 0.7172 0.0957 0.5656 0.0697 4.1907 2.0320 0.4954 5.4394 1.9745 3.4528 3.2525 4.8786 0.8871 1.3949 22.0267 2.5421 3.4390 1.9399 7.9991 21.5370 61.7855 43.9148 4.9602 13.1750 5.1262 145.9388 4.0530 80.9862 61.9018 0.0577 6.4302 50.0627 1.2043 4.9112 2.7665 8.2477 9.4297 15.5270 0.0834 27.0821 297.5784 11.3650 11.2742 3.8957 3.6426 1.3244 51.6891 1.1798 15.7201 4.7150 22.2853 21.4562 6.6923 2.3692 0.3084 158.8120 16.9857 2.7968 7.8600 8.7498 9.0657 5.1085 2.4251 0.0740 16.9506 9.8759 35.9308 20.3343 20.0969
temp: 298.150 k
press: 1.00000 atm
elementType: 8 8 6 6 6 6 6 6 6 6 6 6 6 1 1 1 1 1 1 1 1 1 1 1 1
symmnumber: 1
zpe: 522090.4 jmol-1
zpe.correction: 0.198854 hartree
zpe.thermalcorrener: 0.211132 hartree
zpe.thermalcorrenthalpy: 0.212076 hartree
zpe.thermalcorrgfe: 0.157963 hartree
zpe.sumelectzpe: -575.849091 hartree
zpe.sumelectthermal: -575.836813 hartree
zpe.sumelectthermalent: -575.835869 hartree
zpe.sumelectthermalfe: -575.889983 hartree
dipole: 0.6520 0.5391 -1.7085
dipole: 1.9065
quadrupole: -70.7952 -73.8971 -73.8189
quadrupole: -2.5707 3.9620 4.5238
quadrupole: 2.0419 -1.0600 -0.9818 -2.5707 3.9620 4.5238
hfenergy: -576.0479451 hartree
pointgroup: C01 [X(C11H12O2)]
dipole: -0.1704712 0.121379 0.7202756 debye
dipolederiv: -0.8686027 0.4659873 0.1756958 0.6278336 -1.2298247 -0.389781 0.2506394 -0.4488104 -0.6120848 -0.4290989 0.1015576 -0.1066417 0.2132611 -0.5302759 0.0322896 0.1589855 -0.3036739 -0.9360324 0.8225716 -0.1916818 -0.1089577 -0.1876356 0.8135494 0.1104956 0.0518251 -0.0608237 0.1221898 0.0630421 0.087595 -0.0036048 -0.0174718 -0.1951211 -0.0268287 0.0151047 0.0172992 -0.0256623 -0.0415429 -0.0066075 0.0851318 -0.0355705 -0.1548323 -0.0134455 0.0314169 -0.018358 0.0056101 -0.0841462 0.0323754 -0.0536222 0.006705 -0.1240232 -0.0339353 0.0068792 -0.0322838 0.0411404 -0.3006822 0.0398845 -0.0219462 0.1999882 0.0493965 -0.0039157 -0.0420406 0.0567303 0.1415252 -0.0622661 0.043851 -0.0641479 0.0551793 -0.1095337 -0.0740868 -0.0739632 -0.0709196 0.0934966 -0.0122102 0.0050498 0.1163182 0.0181275 -0.1210232 -0.0022494 0.1217189 0.0011304 0.055812 0.0680476 0.0641672 -0.0061598 0.0626332 -0.1370991 -0.0250876 -0.0112574 -0.0319449 -0.0535496 0.6334639 -0.5545487 0.038907 -0.8461338 1.1950594 0.2219442 -0.3987619 0.6913258 1.3150455 -0.3430436 0.0863728 -0.038544 0.0340833 -0.1521559 0.0584623 -0.0441634 0.0277872 0.0904903 -0.0647475 0.1574398 -0.0589747 0.2383591 -0.2622064 0.1158094 -0.1094989 0.127514 -0.096564 0.0134419 0.0146611 0.0098256 -0.0046322 0.0179596 0.0112278 0.0002382 0.0802703 -0.0430308 0.0280631 -0.0166871 -0.1067999 -0.016677 0.13731 0.0043569 -0.1069844 0.0040005 -0.0013618 0.0670684 -0.0364009 0.0810149 -0.0350477 0.1168178 0.0481311 0.0574828 0.0464862 -0.0371653 0.1395583 -0.0565208 0.0507952 -0.0292741 0.06113 0.0425068 0.0300874 -0.0304048 -0.0819236 0.0474433 -0.0393195 0.0583206 -0.0424063 0.1269977 0.069529 0.0772367 0.0709589 -0.0819956 -0.007504 -0.0209186 -0.0968055 -0.022076 0.1488755 0.0137346 -0.116638 0.0100816 -0.0417877 -0.1142475 -0.075982 0.0192168 -0.0811037 0.1319244 0.020249 0.0184025 0.0186024 0.0905541 0.1963257 -0.066089 -0.0120209 -0.0923299 -0.0480214 -0.0835551 -0.0067989 -0.0977013 0.0233133 0.152434 -0.0337267 0.0230029 -0.0186068 0.1029205 -0.0308216 0.0425598 0.0130202 -0.0960476 0.0143021 -0.0779801 0.0605037 -0.0382987 0.042916 0.0530807 0.048887 0.0586448 0.0846291 0.0405963 -0.0115247 -0.0830013 -0.06814 0.0728756 -0.069823 -0.0844193 -0.0552435 0.0374383 0.0417336 0.0890458 0.0424942 0.0792337 0.0463842 -0.0482872 0.0830619 -0.073688 0.0059608 unknown
polarizability: 138.8795773|14.0508805|110.4162868|-1.8343953|-5.817312|116.0891652 unknown
InChI: InChI=1S/C11H12O2/c1-3-11(13-9(2)12)10-7-5-4-6-8-10/h3-8,11H,1H2,2H3
charge 0 multiplicity 1
25 atoms
O  1.717163 -0.327324 0.360099
O  1.869323 -1.167809 -1.817807
C  0.801767 0.779325 -0.13618
C  -0.643318 0.327917 0.026723
C  -1.138762 -0.074866 1.294089
C  -1.513526 0.323121 -1.089618
C  1.15395 1.994608 0.688666
C  -2.485059 -0.472402 1.43937
C  -2.863777 -0.067668 -0.943558
C  -3.3533 -0.465079 0.321577
C  2.152424 -1.250648 -0.601589
C  1.631447 3.145925 0.157491
C  2.981355 -2.33481 0.053627
H  1.03022 0.946161 -1.203783
H  -0.465458 -0.097678 2.158628
H  -1.130608 0.613955 -2.074787
H  0.983662 1.911943 1.770694
H  -2.858892 -0.787707 2.420083
H  -3.528632 -0.069598 -1.814436
H  -4.399134 -0.771701 0.435491
H  1.856487 4.015585 0.784436
H  1.807854 3.254718 -0.91983
H  2.312117 -3.041516 0.577272
H  3.664273 -1.904318 0.803558
H  3.547622 -2.882835 -0.713616
