program: Gaussian 09
title: 000111243
version: EM64L-G09RevD.01
frameworkgroup: C1[X(C21H34O3)]
method: RPBEPBE
basis: SDD
operation: Freq
keyword: #pfreq=noraman
keyword: PBEPBE/SDD
title: #p freq=noraman PBEPBE/SDD
converged: YES YES NO NO
title: Mulliken charges:
elementType: O O O C C C C C C C C C C C C C C C C C C C C C H H H H H H H H H H H H H H H H H H H H H H H H H H H H H H H H H H
charge: -0.460662 -0.455641 -0.210147 -0.128540 -0.120839 -0.141940 0.358887 0.423709 0.002863 -0.543185 -0.524599 0.131302 -0.507389 -0.553878 -0.492961 -0.540686 -0.516415 -0.585490 -0.828438 -0.872704 -0.451785 -0.074359 0.111745 -0.771311 0.230550 0.196141 0.258265 0.209968 0.217407 0.216055 0.247901 0.191484 0.213214 0.201502 0.217377 0.237363 0.187561 0.204199 0.272235 0.204027 0.231773 0.203771 0.200145 0.207977 0.246756 0.225082 0.231171 0.223091 0.223306 0.218543 0.203005 0.219131 0.195598 0.331922 0.238896 0.272351 0.243544 0.331149
chargesum: 0.00000
title: Mulliken charges with hydrogens summed into heavy atoms:
elementType: O O O C C C C C C C C C C C C C C C C C C C C C
charge: -0.128739 -0.124491 -0.210147 0.102010 0.075302 0.116325 0.358887 0.423709 0.212831 -0.109723 -0.085214 0.131302 -0.092674 -0.099137 -0.101201 -0.064424 -0.080871 -0.177367 -0.125429 -0.207764 -0.029649 0.121239 0.111745 -0.016519
polarizability: 2.72691815e+02 2.91698359e+00 2.10688191e+02 -6.31037247e-01 -7.32794650e-01 1.87499297e+02
1716.lowfreq: -11.5630 -0.0007 -0.0007 0.0002 6.2527 10.8012 37.9069 47.1783 70.8634
frequency: 37.7669 47.1363 70.8595 81.5666 93.0130 110.2475 113.6578 131.0340 159.3279 166.6223 174.6413 203.7525 220.2981 225.3347 241.1306 252.2592 261.6683 267.1917 273.6086 280.7765 290.9964 303.9649 324.1883 341.0583 343.6706 352.6005 378.3904 394.2552 398.6489 411.1049 423.0144 434.6664 438.0806 465.8825 474.1178 495.1015 515.7506 533.3002 543.0809 566.7634 582.7721 621.3395 642.0037 686.8817 688.9021 718.8577 786.2544 794.0617 802.5925 815.1821 819.7339 840.8008 863.4370 880.6577 895.7969 906.6775 918.2895 922.3398 931.6634 944.2940 959.7760 967.3669 974.7256 981.8559 988.9130 999.3398 1005.7669 1016.4533 1023.3951 1030.9921 1048.7248 1056.4629 1058.0165 1075.9589 1081.5655 1094.5047 1106.4238 1113.0838 1119.4794 1123.3980 1132.4593 1143.7046 1156.3030 1158.3401 1166.6329 1178.0161 1194.1266 1205.3586 1208.9762 1214.9133 1215.2437 1234.5106 1235.8336 1249.1397 1256.9783 1271.6152 1281.4459 1282.2404 1287.7098 1297.2529 1298.9592 1306.8595 1316.1071 1319.1662 1323.7275 1331.8373 1335.0532 1338.5140 1340.5595 1348.8245 1353.8615 1358.4890 1368.1534 1371.2036 1372.0055 1385.8210 1393.7153 1404.4939 1437.8910 1444.2303 1451.4422 1456.5826 1458.4726 1463.7816 1466.8299 1469.2362 1473.1513 1475.9754 1478.1863 1487.6615 1490.2318 1492.3966 1495.9582 1610.2236 2910.6203 2936.5598 2941.6203 2945.8236 2950.3763 2957.6099 2963.2201 2967.9887 2969.4688 2976.5064 2983.0268 2987.7041 2988.2011 2991.0895 2993.3029 2993.7306 2996.5398 3007.4619 3013.6418 3024.4770 3030.2434 3037.3290 3050.5218 3050.6519 3053.3455 3071.6692 3072.1476 3078.9985 3079.6821 3080.6672 3096.7567 3125.8928 3554.7557 3558.6862
redmass: 4.7191 4.0766 3.7720 4.1162 3.6456 1.0908 2.9834 2.0699 1.9567 3.2195 3.1635 2.0641 1.7253 2.0849 2.1625 2.2350 2.2187 2.6596 1.4009 2.4210 1.2912 1.9568 2.4473 2.9110 3.1683 2.6125 2.9369 2.8441 2.1837 2.5565 2.7456 3.3047 3.1282 3.3997 3.3819 2.2381 2.7430 2.5793 3.7657 2.9348 3.3831 2.7769 3.1304 2.6781 2.9780 2.6376 1.8513 2.2461 2.3394 2.0497 2.6876 1.9252 2.3532 2.3415 1.7528 2.0242 2.2423 2.2488 2.0432 1.9561 1.9775 1.9193 1.9029 2.2582 2.0491 2.3386 1.8760 1.9125 1.8879 1.8292 2.1307 1.7776 2.8168 1.9285 2.5445 1.7293 1.8323 1.5928 2.0245 2.2501 1.9979 1.5933 1.7748 1.6381 1.7661 1.7825 1.9473 1.5917 1.3549 1.7160 2.1245 1.4403 1.4566 1.5889 1.3220 1.5989 1.3804 1.7684 1.3721 1.3398 1.4893 1.5133 1.3585 1.4408 1.4305 1.3262 1.3840 1.4135 1.4704 1.4420 1.4411 1.5126 1.3853 1.2961 1.3515 1.4451 1.3451 1.1950 1.0715 1.0648 1.0785 1.0797 1.0703 1.0874 1.0903 1.0820 1.0853 1.0847 1.0839 1.0572 1.0734 1.0581 1.0595 8.4198 1.0810 1.0783 1.0803 1.0686 1.0755 1.0675 1.0629 1.0735 1.0695 1.0590 1.0543 1.0618 1.0449 1.0385 1.0615 1.0498 1.0593 1.0971 1.0966 1.1001 1.0998 1.0983 1.0997 1.1013 1.0980 1.0973 1.0995 1.0928 1.0957 1.0973 1.0988 1.1031 1.0659 1.0661
irintensity: 0.4995 1.6701 3.7823 0.7532 0.0799 3.5020 1.4003 0.5135 0.3532 1.8016 1.1618 0.7309 0.1234 3.2792 1.6382 1.9489 2.9253 15.5595 100.1057 16.6121 99.9013 53.4215 6.5101 1.9621 1.0200 6.3003 1.6821 2.3699 6.1415 0.7383 6.2689 2.2181 1.5226 2.7971 0.2410 0.5755 2.3313 2.8082 4.6748 7.4636 7.2432 4.0860 7.9876 2.6586 1.9072 1.3832 1.7217 3.7743 0.4911 0.6825 2.3061 5.3391 34.1262 4.4341 22.4855 3.1816 22.4329 4.4192 1.7219 4.8682 3.9310 11.6626 11.1998 15.3405 2.2880 15.4979 1.4224 1.0865 2.1047 6.2077 19.9300 0.2122 7.1390 4.2230 17.3925 9.1508 15.3854 17.0822 3.2357 8.3018 3.2198 5.2461 2.0377 14.7598 11.7904 6.3596 16.9403 13.8189 7.4755 9.5150 100.0633 13.6020 3.4872 12.7441 2.2234 9.0486 8.9000 1.7891 10.4098 5.1561 0.9027 0.3666 3.5668 1.9723 10.7873 2.9776 2.3767 0.0935 2.2972 3.5019 0.9529 2.0776 3.8546 42.8471 22.8287 4.9677 22.5264 27.5788 18.4275 17.7903 14.9383 2.8000 3.4696 6.7537 10.1039 10.8341 2.9951 15.5660 12.6602 4.6623 4.0666 6.9606 6.8216 104.2869 10.7372 48.2246 6.4343 14.2846 12.3477 48.8729 101.4398 48.0585 30.1802 22.7004 26.1802 37.6661 13.4024 5.6530 33.6374 64.2911 15.6845 14.2612 64.0756 67.4008 29.4583 49.5057 67.3914 11.4782 29.9069 32.0776 27.1564 15.1655 29.2381 42.1861 25.0388 10.2247 2.2129 3.6110
temp: 298.150 k
press: 1.00000 atm
elementType: 8 8 8 6 6 6 6 6 6 6 6 6 6 6 6 6 6 6 6 6 6 6 6 6 1 1 1 1 1 1 1 1 1 1 1 1 1 1 1 1 1 1 1 1 1 1 1 1 1 1 1 1 1 1 1 1 1 1
symmnumber: 1
zpe: 1342568.9 jmol-1
zpe.correction: 0.511357 hartree
zpe.thermalcorrener: 0.535391 hartree
zpe.thermalcorrenthalpy: 0.536335 hartree
zpe.thermalcorrgfe: 0.460824 hartree
zpe.sumelectzpe: -1044.404550 hartree
zpe.sumelectthermal: -1044.380517 hartree
zpe.sumelectthermalent: -1044.379572 hartree
zpe.sumelectthermalfe: -1044.455084 hartree
dipole: 1.6938 1.5149 -0.9028
dipole: 2.4452
quadrupole: -153.2056 -144.5581 -148.1542
quadrupole: 8.1758 16.8180 -6.1892
quadrupole: -4.5663 4.0812 0.4851 8.1758 16.8180 -6.1892
hfenergy: -1044.9159075 hartree
pointgroup: C01 [X(C21H34O3)]
dipole: 0.6640381 0.6073086 -0.3400994 debye
polarizability: 272.666822|3.190811|210.7357681|-0.5095844|-0.1651315|187.4767131 unknown
InChI: InChI=1S/C21H34O3/c1-13(22)21(24)11-8-18-16-5-4-14-12-15(23)6-9-19(14,2)17(16)7-10-20(18,21)3/h14-18,23-24H,4-12H2,1-3H3
charge 0 multiplicity 1
58 atoms
O  -3.287552 -0.230856 -1.959103
O  5.276206 -0.469442 -1.824923
O  -5.445635 -0.207186 0.923751
C  0.142945 0.992706 0.338045
C  0.858274 -0.34274 -0.057712
C  -1.281943 0.983639 -0.255355
C  -2.152069 -0.227011 0.219979
C  2.349844 -0.404172 0.455228
C  3.091004 0.857388 -0.12215
C  0.006047 -1.583029 0.335237
C  -1.447569 -1.534904 -0.211926
C  -3.504972 0.120527 -0.532207
C  0.944753 2.223516 -0.153605
C  -2.201398 2.210055 -0.03983
C  2.419678 2.18171 0.300665
C  -3.637214 1.666514 -0.344979
C  3.062763 -1.661601 -0.13813
C  4.606486 0.850331 0.183579
C  -2.407733 -0.227076 1.751503
C  2.406719 -0.457759 2.00739
C  4.585633 -1.699238 0.131267
C  5.302596 -0.423834 -0.341069
C  -4.727459 -0.665641 -0.007412
C  -5.028141 -2.011764 -0.651203
H  0.073049 1.053858 1.44511
H  0.921568 -0.337542 -1.171985
H  -1.168196 0.851753 -1.353322
H  2.992012 0.779281 -1.228404
H  -0.02186 -1.686192 1.437299
H  0.488006 -2.500237 -0.051584
H  -1.433977 -1.586704 -1.316531
H  -1.998635 -2.423703 0.156762
H  0.46016 3.152936 0.20425
H  0.908891 2.251187 -1.264174
H  -1.930001 3.054077 -0.697508
H  -2.133445 2.572775 1.003486
H  2.973595 3.034813 -0.142313
H  2.481253 2.308625 1.401147
H  -4.343374 1.873942 0.476761
H  -4.062808 2.125432 -1.259012
H  2.90223 -1.67555 -1.234441
H  2.610586 -2.585727 0.270641
H  5.078564 1.746505 -0.273668
H  4.785567 0.934594 1.274642
H  -3.000682 0.641413 2.083986
H  -2.964256 -1.132882 2.054106
H  -1.457957 -0.222255 2.310713
H  1.83702 0.363135 2.476501
H  1.987895 -1.41033 2.379881
H  3.443162 -0.391907 2.382386
H  4.785888 -1.83136 1.212403
H  5.037458 -2.564805 -0.388276
H  6.36158 -0.440483 -0.000801
H  -3.914068 0.304681 -2.508551
H  -5.59528 -1.859457 -1.589703
H  -4.102898 -2.540375 -0.931385
H  -5.645703 -2.615925 0.03287
H  5.688094 0.362895 -2.170824
