program: Gaussian 09
title: 000111236
version: EM64L-G09RevD.01
frameworkgroup: C1[X(C9H11NO)]
method: RPBEPBE
basis: SDD
operation: Freq
keyword: #p
keyword: freq=noraman
keyword: PBEPBE/SDD
title: #p freq=noraman PBEPBE/SDD
converged: NO NO NO NO
title: Mulliken charges:
elementType: O N C C C C C C C C C H H H H H H H H H H H
charge: -0.206224 -0.049812 0.286097 -0.384278 -0.384240 -0.249041 -0.200957 -0.200952 -0.255984 -0.664395 -0.164197 0.212849 0.212258 0.244095 0.244117 0.223700 0.223706 0.226518 0.207084 0.236916 0.237126 0.205614
chargesum: 0.00000
title: Mulliken charges with hydrogens summed into heavy atoms:
elementType: O N C C C C C C C C C
charge: -0.206224 -0.049812 0.286097 -0.140183 -0.140123 0.176066 0.022743 0.022753 -0.029465 0.016732 0.041417
polarizability: 1.73476821e+02 4.35730798e-02 9.68918221e+01 4.52471611e+00 5.33418740e-03 6.40742609e+01
1716.lowfreq: -71.7630 -10.9123 -4.5873 0.0006 0.0007 0.0010 14.4673 34.4657 65.1320
frequency: -71.7591 33.2235 65.1318 89.2748 169.4278 180.4874 253.3334 254.4005 365.6828 401.8376 441.4789 443.4486 528.6904 604.2528 613.7415 696.1789 758.7257 794.3558 813.3199 833.8332 889.4184 898.7277 945.5261 962.0207 982.0829 984.8285 1021.5165 1028.4620 1075.7455 1092.0558 1129.4944 1131.9885 1168.6119 1178.2739 1225.7744 1259.9837 1305.9282 1342.9137 1371.6356 1382.6520 1401.3574 1435.6155 1460.1879 1473.5821 1475.5755 1487.7935 1579.8739 1607.1877 1674.7682 2942.8570 2965.4452 2997.4622 3024.6516 3094.2496 3111.2920 3121.8751 3128.8167 3146.2598 3152.1359 3165.4540
redmass: 3.7632 2.1232 4.4157 2.8822 3.1724 3.8670 1.1493 3.9067 5.3853 2.9767 3.5698 6.4818 3.1838 6.0886 6.5065 1.9987 1.7181 5.2232 1.0899 1.2433 2.1188 1.8761 1.5381 1.3650 1.9275 2.4041 2.1424 2.9465 1.5442 3.5962 2.8621 1.4493 1.0516 1.1269 3.0281 1.1488 1.3740 1.2267 6.1410 1.3195 1.2639 2.3894 1.0398 1.6049 1.3301 1.0755 6.2317 6.1440 8.4134 1.0868 1.0582 1.0366 1.1082 1.0986 1.1018 1.0844 1.0882 1.0924 1.0964 1.1015
irintensity: 10.8366 0.1004 2.0760 0.1298 15.6497 0.0869 0.6279 1.0600 2.1301 0.0650 4.3745 0.5429 10.3318 0.0588 0.0885 37.0717 78.8682 27.2654 4.4599 0.0419 3.7476 17.1525 9.8774 0.0587 0.5611 0.2697 23.0202 22.5676 9.8434 396.6220 195.0368 13.2466 0.3115 4.1187 42.4922 0.0087 0.0586 66.6755 2.4079 1.4729 34.0187 2.1067 12.0846 6.3653 44.0035 15.8089 5.1989 70.6682 624.6656 22.7904 76.8634 23.0474 33.0950 30.3755 31.4227 3.3916 7.0622 21.7551 32.7208 15.6566
temp: 298.150 k
press: 1.00000 atm
elementType: 8 7 6 6 6 6 6 6 6 6 6 1 1 1 1 1 1 1 1 1 1 1
symmnumber: 1
zpe: 467530.0 jmol-1
zpe.correction: 0.178073 hartree
zpe.thermalcorrener: 0.188223 hartree
zpe.thermalcorrenthalpy: 0.189167 hartree
zpe.thermalcorrgfe: 0.141139 hartree
zpe.sumelectzpe: -478.687382 hartree
zpe.sumelectthermal: -478.677232 hartree
zpe.sumelectthermalent: -478.676288 hartree
zpe.sumelectthermalfe: -478.724315 hartree
dipole: -2.0228 -0.0063 3.5079
dipole: 4.0493
quadrupole: -50.8133 -60.0853 -70.5621
quadrupole: 0.0191 -4.6126 -0.0031
quadrupole: 9.6736 0.4016 -10.0752 0.0191 -4.6126 -0.0031
hfenergy: -478.8654548 hartree
pointgroup: C01 [X(C9H11N1O1)]
dipole: 0.7803618 -0.0000203 1.3889151 debye
dipolederiv: -2.272531 -0.0007583 -0.3320561 0.0021388 -0.3169279 0.0009105 0.1871053 0.0002533 -0.3210626 -1.9939097 -0.001118 0.032968 -0.0010997 -0.2569459 0.0000224 -0.1919777 0.0003811 -0.4997637 1.4568823 0.001514 -0.1396373 0.0014751 0.0595548 -0.0000101 -0.3547372 -0.0002611 0.0738935 -0.3906225 -0.0002084 -0.0312858 0.2131781 0.0233739 -0.0656672 0.0201799 -0.0188886 -0.1605246 -0.3902991 -0.000489 -0.0313497 -0.2140032 0.0227989 0.065995 0.0198171 0.0192795 -0.1603203 1.0305914 0.0015334 0.2326133 0.0013929 0.391497 -0.0007216 0.562867 -0.0000826 0.407696 0.1063783 0.0158299 -0.0641646 -0.014348 0.1342848 0.0189422 -0.0696755 -0.0051253 -0.1267021 0.1063873 -0.0157451 -0.0641724 0.0143834 0.1343431 -0.0184455 -0.069685 0.0055756 -0.1267338 -0.0402062 0.0002222 -0.0581116 0.0001842 -0.1818723 -0.0000692 -0.0322395 -0.0000321 -0.1847496 -0.1357724 0.0012973 0.0462866 0.0011411 0.0452426 -0.0005021 0.0219188 -0.0006795 0.0358904 2.5365064 0.0009703 0.2651656 -0.0007098 0.0942087 -0.000977 -0.0208194 -0.0005691 0.5930464 -0.0478878 0.0518845 0.0176219 0.0046193 -0.0882813 -0.1369191 -0.1124376 -0.0963494 -0.0572815 -0.0483295 -0.0531795 0.0209347 -0.0073708 -0.0831767 0.1370624 -0.109653 0.0970281 -0.0614372 0.0551912 -0.0900779 0.0379571 -0.0773452 -0.0378311 0.0199796 0.0360745 0.0241405 0.1469518 0.0548872 0.090149 0.0382091 0.0774518 -0.0373674 -0.0203104 0.0362951 -0.0244866 0.1468504 0.0123353 0.090264 0.0223005 0.1088177 -0.079629 -0.020722 0.0320784 -0.0198682 0.148693 0.0127446 -0.0901036 0.0220521 -0.1086859 -0.0801159 0.0202422 0.0317778 0.0194135 0.1487849 -0.1293408 -0.0002924 0.0677215 -0.000303 0.0835424 -0.0000101 0.0777532 -0.0000015 0.1540913 -0.0904841 0.0000283 -0.1043036 -0.0000952 0.1160211 -0.0007285 -0.1392489 -0.0004943 -0.0294932 0.1040349 -0.0023459 0.0101435 0.0267053 -0.0563125 -0.1094207 0.063709 -0.1022069 0.0308125 0.1035041 0.0006747 0.0114815 -0.027575 -0.0519174 0.110772 0.0656477 0.1029732 0.0269738 -0.04006 -0.0000497 -0.0003745 0.0000483 0.1655102 0.0005771 -0.0547498 0.0000002 -0.1856154 unknown
polarizability: 173.5642833|0.0410237|96.8917295|-3.3011051|0.0527654|63.986891 unknown
InChI: InChI=1S/C9H11NO/c1-2-11-8-10-9-6-4-3-5-7-9/h3-8H,2H2,1H3
charge 0 multiplicity 1
22 atoms
O  2.734466 0.002967 -0.266167
N  0.45936 0.002686 -0.696281
C  -0.907314 0.000828 -0.287619
C  -1.605675 1.227462 -0.121051
C  -1.603141 -1.227629 -0.123904
C  3.766757 0.005462 0.80465
C  -2.975501 1.219228 0.220646
C  -2.972964 -1.223046 0.217828
C  -3.667681 -0.00283 0.39381
C  5.1228 -0.010027 0.103927
C  1.41694 0.003078 0.166803
H  3.64534 0.914149 1.428438
H  3.633366 -0.889895 1.445135
H  -1.070916 2.170891 -0.276142
H  -1.066405 -2.169572 -0.281173
H  -3.503178 2.171651 0.349028
H  -3.498651 -2.176863 0.344025
H  -4.731322 -0.004227 0.655893
H  5.935442 -0.008284 0.853714
H  5.223903 -0.911426 -0.523585
H  5.235642 0.878129 -0.540245
H  1.280732 0.002169 1.27017
