program: Gaussian 09
title: 000111210
version: EM64L-G09RevD.01
frameworkgroup: C1[X(C30H18N4O4)]
method: RPBEPBE
basis: SDD
operation: Freq
keyword: #p
keyword: freq=noraman
keyword: PBEPBE/SDD
title: #p freq=noraman PBEPBE/SDD
converged: YES YES NO YES
title: Mulliken charges:
elementType: O O O O N N N N C C C C C C C C C C C C C C C C C C C C C C C C C C C C C C H H H H H H H H H H H H H H H H H H
charge: -0.293221 -0.293255 -0.191524 -0.191516 -0.665777 -0.665775 -0.093048 -0.093085 0.080584 0.080579 0.329357 0.329341 0.275246 0.275285 0.273174 0.273173 -0.106002 -0.105967 0.200738 0.200732 -0.259795 -0.259825 0.272647 0.272686 -0.445613 -0.445599 -0.381611 -0.381615 -0.375209 -0.375212 -0.375082 -0.375086 -0.226906 -0.226903 -0.227544 -0.227543 -0.352038 -0.352030 0.294150 0.294152 0.281316 0.281317 0.292737 0.292740 0.291465 0.291468 0.240014 0.240015 0.240802 0.240803 0.217833 0.217830 0.309702 0.393595 0.393603 0.309697
chargesum: 0.00000
title: Mulliken charges with hydrogens summed into heavy atoms:
elementType: O O O O N N N N C C C C C C C C C C C C C C C C C C C C C C C C C C C C C C
charge: -0.293221 -0.293255 -0.191524 -0.191516 0.037520 0.037525 -0.093048 -0.093085 0.080584 0.080579 0.329357 0.329341 0.275246 0.275285 0.273174 0.273173 -0.106002 -0.105967 0.200738 0.200732 -0.259795 -0.259825 0.272647 0.272686 -0.151463 -0.151446 -0.100295 -0.100297 -0.082471 -0.082473 -0.083616 -0.083618 0.013109 0.013112 0.013257 0.013260 -0.134204 -0.134200
polarizability: 1.40648562e+03 -7.66873814e+00 3.97088858e+02 -5.57942633e-02 -6.10517487e-03 1.33988369e+02
1716.lowfreq: -7.8729 -3.5577 -0.0020 -0.0016 0.0012 3.2619 4.4658 12.5022 16.9541
frequency: 4.4653 12.5022 16.9541 26.6727 49.5659 70.9826 76.4793 89.1415 90.2077 93.8539 108.9779 111.3828 133.2803 134.1244 177.5781 177.8959 179.4863 185.5989 224.7213 236.0821 255.9307 259.9649 277.2731 300.8564 319.2609 340.6984 349.2817 353.6275 376.5332 380.7292 384.0538 394.4153 419.7739 419.8089 426.7258 444.1731 447.6651 451.8715 455.3591 459.8289 492.1557 502.6764 505.3728 514.2511 540.4757 542.1050 547.5564 551.6212 575.6880 578.7270 583.9192 628.5155 646.9189 652.0137 668.6201 674.2498 682.2279 685.1649 687.4065 729.5275 729.8123 765.7870 767.1674 768.1052 768.8912 807.3175 807.3740 831.9727 837.2293 855.4750 855.9454 866.5286 866.6316 887.3808 890.6038 894.5745 895.3092 941.2115 943.5969 946.6058 954.0385 954.3360 959.3657 981.9865 998.5773 998.5906 1011.2034 1011.2580 1015.7707 1015.7723 1016.0933 1022.8978 1037.6906 1038.9689 1087.2746 1087.3208 1137.9107 1140.9816 1165.9657 1166.5270 1172.6218 1172.9766 1200.6147 1200.8699 1221.2812 1233.5422 1257.3868 1258.8659 1287.2348 1289.0950 1308.7875 1310.5400 1322.5461 1322.9408 1347.8023 1373.5567 1386.0315 1386.3477 1402.9614 1403.7300 1414.0774 1414.9509 1443.8925 1445.4578 1450.3392 1453.5213 1470.5642 1470.7469 1474.2379 1499.3326 1505.0069 1533.7307 1534.2885 1566.5413 1570.4644 1572.0209 1576.0685 1579.4528 1603.5816 1604.7068 1609.8563 1610.0206 1611.4095 1612.4504 3026.9550 3030.9190 3137.2471 3137.2506 3152.9240 3152.9337 3155.7704 3155.7823 3164.9056 3164.9135 3173.5422 3173.5752 3175.3711 3175.4059 3222.9960 3223.3307 3630.3433 3630.4411
redmass: 6.9079 6.7196 7.0093 6.6478 8.5749 7.8562 7.2420 3.1704 4.9025 3.5821 8.7000 8.4521 5.6930 5.6929 3.4946 7.2421 6.0820 6.3139 5.2096 6.6711 4.8704 4.7281 7.1083 8.0315 7.5585 3.9176 6.2644 5.7011 6.2541 6.6224 7.4583 8.5149 3.1980 3.1966 10.4541 5.8955 4.6685 8.6782 4.6902 10.5404 1.8166 7.4555 1.5634 5.5064 2.1184 2.7557 7.0174 6.4358 3.8169 4.1007 6.4356 5.7882 6.7711 6.2301 5.8859 6.8065 6.8184 4.4997 4.5023 2.3696 2.3534 4.8738 6.6308 6.6742 5.0583 1.7362 1.7402 5.2402 5.8330 1.6963 1.6643 1.2621 1.2805 6.5989 6.4705 1.5374 1.5294 1.8054 2.1548 1.9082 3.2736 1.6094 2.9640 6.6709 1.3924 1.3924 1.3892 1.3870 1.3747 1.3747 3.9021 3.4749 2.1030 2.2680 2.3388 2.3323 1.6966 1.7186 1.6741 1.6713 1.1507 1.1604 2.1012 2.0324 2.2545 1.9720 1.6752 1.6722 2.1788 2.0822 2.0766 3.0978 3.9973 4.7959 2.4797 2.7985 6.4478 6.4086 8.5088 7.4577 3.4869 3.9067 3.3224 3.0508 3.6241 4.6918 2.9316 2.7577 3.6724 4.8993 4.8206 8.5975 8.8669 7.1737 5.7511 4.2021 4.2496 5.0536 5.7209 4.2054 6.2800 6.7202 1.8323 2.0495 1.0857 1.0869 1.0864 1.0864 1.0905 1.0905 1.0886 1.0886 1.0947 1.0947 1.0996 1.0996 1.0964 1.0964 1.0662 1.0663 1.0864 1.0864
irintensity: 0.3605 0.4463 0.0174 0.0000 5.0190 0.0000 0.0000 0.0001 0.0024 0.0001 16.2163 0.0008 0.0000 0.9547 1.5584 0.0010 1.0325 6.4821 0.0000 0.0000 5.3902 0.0000 19.2830 2.4740 0.0000 7.8682 4.5454 0.0000 0.0001 20.4487 0.0000 63.7961 0.0664 0.0001 0.0000 42.4984 0.0229 0.0000 0.0002 35.7878 49.8454 0.0000 0.0001 0.0000 159.1903 0.0169 6.6095 4.3199 31.0776 0.0002 0.0001 0.0000 48.1826 0.0000 17.1692 0.0000 3.9277 12.6560 0.0000 87.7819 0.0011 22.6081 0.0001 13.8991 0.0002 64.4642 0.0012 18.6188 0.0001 114.8654 0.0419 136.0297 45.2173 61.7895 0.0001 34.0360 0.0005 17.1070 0.0000 44.8651 281.9740 0.0763 0.0008 0.0000 0.2384 11.2914 0.0030 0.0004 0.0059 0.0011 167.9934 0.0001 19.0105 0.0001 5.0804 0.0037 22.5639 0.0002 30.6155 0.0009 37.1406 0.0012 10.5436 0.0017 26.4320 0.0000 110.6817 0.0003 1620.6557 0.0033 297.7683 0.0135 945.0325 0.0289 216.3421 0.0000 368.8411 0.2796 0.0007 48.7634 0.0173 33.5613 37.7839 0.0002 120.7189 0.0002 0.0398 77.9566 0.0001 397.0741 0.0056 0.0048 676.8954 8.8059 0.0005 122.2772 0.0006 232.0518 136.2166 0.0053 50.6549 0.0004 337.0162 0.0073 51.7401 0.0005 3.5417 4.4410 24.8620 1.4563 1.1525 0.2189 5.3747 3.1277 91.6019 1.0022 4.1311 0.0317 337.4499 57.2353 60.8711 10.4676
temp: 298.150 k
press: 1.00000 atm
elementType: 8 8 8 8 7 7 7 7 6 6 6 6 6 6 6 6 6 6 6 6 6 6 6 6 6 6 6 6 6 6 6 6 6 6 6 6 6 6 1 1 1 1 1 1 1 1 1 1 1 1 1 1 1 1 1 1
symmnumber: 1
zpe: 1074294.9 jmol-1
zpe.correction: 0.409177 hartree
zpe.thermalcorrener: 0.438923 hartree
zpe.thermalcorrenthalpy: 0.439867 hartree
zpe.thermalcorrgfe: 0.344946 hartree
zpe.sumelectzpe: -1671.394213 hartree
zpe.sumelectthermal: -1671.364468 hartree
zpe.sumelectthermalent: -1671.363523 hartree
zpe.sumelectthermalfe: -1671.458445 hartree
dipole: 0.0005 -0.0001 0.0022
dipole: 0.0023
quadrupole: -165.6324 -222.4531 -224.2970
quadrupole: 24.9526 -0.0462 0.0041
quadrupole: 38.4951 -18.3256 -20.1695 24.9526 -0.0462 0.0041
hfenergy: -1671.8033905 hartree
pointgroup: C01 [X(C30H18N4O4)]
dipole: 0.0001889 0.0000297 -0.0008808 debye
polarizability: 1406.5387963|0.6751848|397.0174334|2.427669|1.8942235|134.0066203 unknown
InChI: InChI=1S/C30H18N4O4/c31-25-15(9-11-21-23(25)29(37)19-7-3-1-5-17(19)27(21)35)13-33-34-14-16-10-12-22-24(26(16)32)30(38)20-8-4-2-6-18(20)28(22)36/h1-14H,31-32H2
charge 0 multiplicity 1
56 atoms
O  -6.520639 2.615682 -0.022213
O  6.521901 -2.616479 -0.037411
O  -7.23407 -2.860478 -0.062252
O  7.236625 2.859519 0.004547
N  -3.948378 2.300702 -0.0196
N  3.949792 -2.300892 -0.040104
N  -0.619784 -0.34506 -0.033473
N  0.621721 0.345451 -0.027332
C  -5.493691 0.418638 -0.036303
C  5.495529 -0.41918 -0.023264
C  -5.694949 -0.998479 -0.046804
C  5.697078 0.99787 -0.012436
C  -8.024662 0.745014 -0.039289
C  8.026393 -0.746156 -0.020279
C  -8.229721 -0.664132 -0.049816
C  8.231778 0.662952 -0.009428
C  -6.651629 1.329353 -0.031991
C  6.653233 -1.330152 -0.027599
C  -4.13967 0.944177 -0.030103
C  4.141365 -0.944415 -0.029777
C  -7.068048 -1.597339 -0.053543
C  7.070317 1.596426 -0.005181
C  -3.022218 0.015343 -0.035025
C  3.024146 -0.01534 -0.024962
C  -4.593488 -1.884089 -0.051129
C  4.595806 1.883745 -0.008254
C  -3.284705 -1.378998 -0.045356
C  3.286916 1.378964 -0.014448
C  -9.143844 1.614434 -0.035726
C  9.145376 -1.615828 -0.024131
C  -9.546583 -1.18682 -0.056738
C  9.54876 1.185334 -0.002604
C  -10.450911 1.087977 -0.042669
C  10.452563 -1.089668 -0.017291
C  -10.653858 -0.316153 -0.053239
C  10.655835 0.314413 -0.006506
C  -1.646649 0.496101 -0.02971
C  1.648533 -0.495865 -0.030476
H  -4.79491 -2.958669 -0.059049
H  4.797519 2.958268 -0.000035
H  -2.421448 -2.051366 -0.048731
H  2.423791 2.0515 -0.011098
H  -8.960171 2.6929 -0.027576
H  8.961458 -2.69425 -0.032407
H  -9.67026 -2.274282 -0.064715
H  9.672685 2.272765 0.005676
H  -11.312381 1.764316 -0.039917
H  11.313878 -1.766203 -0.020276
H  -11.671104 -0.721749 -0.058652
H  11.673176 0.719772 -0.001253
H  -1.428534 1.578096 -0.022675
H  1.430209 -1.577823 -0.037266
H  -3.017985 2.710095 -0.015174
H  -4.807663 2.882665 -0.016931
H  4.808971 -2.883043 -0.042496
H  3.0193 -2.710063 -0.04531
