program: Gaussian 09
title: 000111207
version: EM64L-G09RevD.01
frameworkgroup: C1[X(C6H11NO4)]
method: RPBEPBE
basis: SDD
operation: Freq
keyword: #p
keyword: freq=noraman
keyword: PBEPBE/SDD
title: #p freq=noraman PBEPBE/SDD
converged: YES YES NO NO
title: Mulliken charges:
elementType: O O O O N C C C C C C H H H H H H H H H H H
charge: -0.271335 -0.261505 -0.240585 -0.257157 -0.643855 -0.145298 -0.487554 0.209838 0.261213 -0.497938 -0.506788 0.249388 0.267587 0.265435 0.308923 0.306200 0.243748 0.245257 0.234590 0.243793 0.241120 0.234921
chargesum: 0.00000
title: Mulliken charges with hydrogens summed into heavy atoms:
elementType: O O O O N C C C C C C
charge: -0.271335 -0.261505 -0.240585 -0.257157 -0.028731 0.104091 0.045469 0.209838 0.261213 0.225657 0.213045
polarizability: 1.08414477e+02 -3.15817080e-01 8.40200549e+01 -1.70826902e+00 4.44260634e-01 6.21073761e+01
1716.lowfreq: -8.4952 -4.6396 -0.0007 -0.0006 -0.0004 2.5951 32.4455 60.0371 66.2225
frequency: 32.3020 60.0351 66.2217 90.9223 95.9219 98.5436 155.2871 166.5179 190.8395 263.7847 270.0091 306.2865 341.1539 355.8010 436.5294 456.1733 555.2092 605.3273 622.3596 642.7359 721.1648 806.6675 864.0324 896.4173 950.1054 958.8001 1036.5261 1112.9642 1113.4080 1115.8563 1148.4084 1149.2059 1154.8096 1166.2905 1193.9638 1201.6866 1286.6940 1328.9398 1361.1362 1420.6436 1423.1844 1424.0998 1452.7896 1453.1932 1463.4455 1464.1622 1591.4066 1634.6285 1653.9055 2890.3608 3005.5150 3006.9873 3017.0838 3082.9342 3107.8570 3110.0965 3150.9488 3152.3457 3491.5210 3633.5890
redmass: 5.2240 3.0089 3.5170 1.2419 1.2050 2.9656 3.8859 3.7489 3.5236 4.3555 3.4879 1.5683 4.5142 2.3275 4.2383 2.9218 3.2719 1.4096 3.3341 5.0800 5.5245 5.0775 4.9622 2.9061 5.5336 4.6897 3.0004 1.2766 1.3002 2.0943 1.5058 1.4473 2.4991 2.1670 1.6698 1.5099 1.6811 1.4032 1.8396 1.1258 1.1720 1.1834 1.0500 1.0502 1.0505 1.0506 1.3994 9.2452 3.3569 1.0799 1.0296 1.0294 1.0596 1.1003 1.1047 1.1048 1.1048 1.1050 1.0450 1.0999
irintensity: 1.6658 0.1031 0.2132 0.2292 0.1170 1.2644 1.5221 5.3896 12.3627 4.9786 27.5701 26.9054 8.1182 33.8843 6.5593 6.0858 15.2191 226.1232 46.9581 6.2551 8.6825 7.8683 8.9834 8.1649 22.9449 26.1236 10.4579 3.7130 12.1751 189.8515 43.7470 15.7673 170.1604 163.4311 16.0410 17.2084 93.3321 21.6675 22.3703 38.2049 22.1792 19.2986 14.9487 14.3966 11.5457 13.1952 254.5871 110.9960 100.0876 46.5835 37.4059 28.6271 6.6317 4.5423 26.6880 24.9503 15.8696 14.2873 5.2213 25.7088
temp: 298.150 k
press: 1.00000 atm
elementType: 8 8 8 8 7 6 6 6 6 6 6 1 1 1 1 1 1 1 1 1 1 1
symmnumber: 1
zpe: 454639.2 jmol-1
zpe.correction: 0.173163 hartree
zpe.thermalcorrener: 0.186453 hartree
zpe.thermalcorrenthalpy: 0.187398 hartree
zpe.thermalcorrgfe: 0.132062 hartree
zpe.sumelectzpe: -589.997521 hartree
zpe.sumelectthermal: -589.984230 hartree
zpe.sumelectthermalent: -589.983286 hartree
zpe.sumelectthermalfe: -590.038622 hartree
dipole: -0.3241 -2.5514 0.5796
dipole: 2.6364
quadrupole: -51.7679 -63.7531 -67.5352
quadrupole: -4.5279 4.0449 0.5074
quadrupole: 9.2509 -2.7344 -6.5164 -4.5279 4.0449 0.5074
hfenergy: -590.1706837 hartree
pointgroup: C01 [X(C6H11N1O4)]
dipole: 0.1246676 1.029051 0.037493 debye
dipolederiv: -0.8147834 0.3473878 -0.0387319 0.5284517 -1.1820853 -0.0202937 -0.032638 -0.0413782 -0.2897309 -1.2965021 -0.313666 0.2400557 -0.4163262 -0.5390089 0.231832 0.3653736 0.2445524 -0.5301078 -0.7700334 -0.3333078 -0.0915699 -0.0097178 -0.8250149 -0.052614 -0.1224606 -0.1205955 -0.3255867 -0.6851465 0.0845737 -0.149311 -0.1779449 -0.5952804 0.308381 0.1299684 0.3378895 -0.6739195 -0.4306563 0.075796 0.184738 -0.0428067 -0.6887782 -0.0388324 0.1654867 -0.0851439 -0.6780179 -0.1408185 0.053698 -0.1147279 -0.0115966 0.5511261 0.0896011 -0.2509009 0.0382755 0.339977 -0.2953292 -0.0247883 -0.0680966 0.1780328 -0.0477803 0.1127047 -0.1528863 0.1333281 -0.0090887 1.1872681 0.109291 0.1649885 -0.3440081 1.5213836 0.0942013 0.2483131 0.1517583 0.2281436 1.4873845 0.1892786 -0.0387795 0.4720928 0.7608279 -0.5765379 -0.3749008 -0.611685 0.8528369 0.5402206 -0.2393087 0.0094887 -0.1832601 0.3501595 -0.0156451 0.0354273 -0.0370419 0.2748914 0.6294402 0.0853683 -0.0557301 0.0121738 0.2523387 0.0252289 0.0276632 0.0340839 0.2409967 0.05401 0.0137522 -0.0132276 0.0203711 -0.0459924 -0.0736106 0.0582481 -0.1049954 -0.1359235 0.1003271 -0.0002236 0.003537 -0.0199901 -0.0656021 -0.0214175 0.0123506 -0.0375171 0.1053867 0.056345 -0.0113147 -0.00327 -0.0326896 0.1084 -0.035698 0.0236346 -0.0033918 -0.0434131 0.1712603 -0.1171499 -0.0069391 -0.0528203 0.1953325 0.0119945 0.0406259 0.0645039 0.3302902 0.2313812 0.0504364 -0.1201389 0.0723037 0.2079992 -0.0184915 -0.1365431 0.0416634 0.2607542 -0.063916 0.0434808 0.0599122 -0.0557969 0.053133 0.0860299 0.0811158 0.0592477 -0.0118351 -0.003213 0.0677386 -0.0284858 -0.0079157 0.0792627 -0.0716889 -0.0774366 -0.0113423 -0.0863355 0.0737907 -0.0088075 -0.0084948 0.0473065 -0.1165156 -0.018603 -0.0046442 -0.0252194 0.116815 -0.0215012 -0.0018464 0.0139391 0.101806 -0.0881898 -0.0517853 -0.027365 -0.0343814 0.0967239 -0.0141009 -0.0171432 0.0127422 0.007687 0.0809614 -0.0559263 -0.0933463 -0.0871533 -0.0856824 0.0045729 -0.0532452 0.0481015 -0.0853524 0.0333235 0.0911708 0.0849144 0.0945424 0.0228257 unknown
polarizability: 108.4713196|-0.0070413|83.1259369|0.6876273|-4.35326|62.9446518 unknown
InChI: InChI=1S/C6H11NO4/c1-10-5(8)3-4(7)6(9)11-2/h4H,3,7H2,1-2H3
charge 0 multiplicity 1
22 atoms
O  -2.234576 1.051548 0.187842
O  2.759233 0.817013 -0.705079
O  -2.864446 -1.156257 -0.193645
O  2.266512 -0.705516 0.98422
N  -0.259316 -2.037995 0.074375
C  -0.519554 -0.63799 0.40705
C  0.444242 0.309103 -0.355042
C  -1.981054 -0.314931 0.087409
C  1.88063 0.058446 0.066694
C  -3.641071 1.46362 -0.046892
C  4.19991 0.663615 -0.382141
H  -0.396859 -0.418284 1.495518
H  0.194712 1.369242 -0.166005
H  0.357481 0.132114 -1.441415
H  -1.097045 -2.621403 0.00866
H  0.529416 -2.444347 0.579227
H  -4.305321 0.985994 0.692616
H  -3.958698 1.172045 -1.06176
H  -3.635316 2.556028 0.070359
H  4.511779 -0.384884 -0.522177
H  4.391408 0.962251 0.66217
H  4.716533 1.329288 -1.087283
