program: Gaussian 09
title: 000002345
version: EM64L-G09RevD.01
frameworkgroup: C1[X(C14H12O2)]
method: RPBEPBE
basis: SDD
operation: Freq
keyword: #pfreq=noraman
keyword: PBEPBE/SDD
title: #p freq=noraman PBEPBE/SDD
converged: NO YES NO YES
title: Mulliken charges:
elementType: O O C C C C C C C C C C C C C C H H H H H H H H H H H H
charge: -0.286327 -0.260290 0.474088 -0.427049 0.217566 -0.385996 -0.385992 0.201518 -0.224659 -0.224664 -0.341995 -0.336055 -0.231751 -0.220130 -0.217872 -0.222279 0.234697 0.234708 0.235468 0.235471 0.228927 0.228927 0.269842 0.276043 0.231095 0.233185 0.231552 0.231973
chargesum: 0.00000
title: Mulliken charges with hydrogens summed into heavy atoms:
elementType: O O C C C C C C C C C C C C C C
charge: -0.286327 -0.260290 0.474088 0.042356 0.217566 -0.150529 -0.150521 0.201518 0.004268 0.004263 -0.072152 -0.060012 -0.000656 0.013055 0.013680 0.009694
polarizability: 2.13485690e+02 1.44070674e+01 1.42839726e+02 1.94718909e-02 -3.17727448e-03 1.06531880e+02
1716.lowfreq: -16.4185 -4.2756 -3.5194 -3.4613 -0.0005 -0.0004 0.0007 10.0023 43.8480
frequency: -14.4371 8.8897 43.8362 58.5894 102.7469 135.8256 195.1936 222.5958 260.1422 323.8801 356.8738 401.3664 403.7208 442.2060 450.7304 517.0139 569.2438 613.7806 617.1058 660.1998 679.7871 701.9730 702.2494 756.7556 778.8450 794.6456 853.5492 858.6569 865.8026 876.6895 932.6070 946.9671 955.2589 977.1840 990.4261 991.0839 996.8563 998.0222 1008.6441 1018.0984 1026.9484 1049.1521 1086.2295 1088.7722 1173.3791 1173.9259 1181.8206 1188.3798 1191.4744 1229.0356 1238.5802 1315.4106 1325.9178 1354.3517 1386.3564 1389.8392 1437.9908 1440.8051 1470.9168 1477.8113 1487.6943 1583.6450 1596.3720 1611.2350 1616.8998 1619.0248 3015.4763 3079.1505 3122.8950 3124.8225 3129.9629 3137.2899 3142.6589 3149.7401 3155.4065 3166.0605 3167.1704 3178.8674
redmass: 3.9187 4.1793 5.3656 5.5591 5.0932 5.2375 5.2189 6.5854 5.6307 2.1807 6.3096 2.7991 2.8319 3.6647 5.3341 4.6423 4.8976 6.4424 6.3346 6.9422 5.0533 1.6124 1.8278 1.8942 6.3213 2.1562 1.2470 3.9682 1.2436 6.1154 1.6244 1.6302 1.4182 1.3919 6.2618 6.1546 1.3843 1.3250 1.3262 3.2405 2.1759 2.8164 1.6873 1.5172 1.0539 1.0574 1.1280 1.1159 1.0891 2.4685 3.2240 1.3211 1.2732 1.5095 8.7776 9.8719 2.2492 2.1981 1.0988 2.2894 2.4374 6.9465 6.1450 6.3540 7.7089 7.3210 1.0579 1.1076 1.0854 1.0884 1.0855 1.0919 1.0892 1.0963 1.0939 1.1017 1.0979 1.0979
irintensity: 0.0018 0.4521 0.3552 1.8443 0.8745 1.0266 1.2265 5.4267 7.3520 1.1177 2.2519 0.0024 0.0007 0.4874 0.9320 17.8191 13.1744 0.6807 0.1175 2.7955 14.3956 88.8015 52.3793 70.1957 2.7700 23.9128 0.0011 23.3527 0.0436 57.0122 0.9812 2.3468 3.5186 0.0059 1.6666 1.7626 0.0735 0.2886 0.3497 147.9460 3.0175 249.0824 21.4567 7.2415 0.0006 0.3141 54.0757 0.0344 1.5758 31.6846 357.0891 2.4680 0.2298 13.5686 0.3524 2.4453 17.6653 9.3311 6.2477 6.6028 6.9880 51.2374 0.6848 19.9623 91.6262 77.4454 19.2679 12.4040 5.2797 2.1011 0.2827 13.9129 11.6292 39.4409 16.0008 22.7740 20.1385 8.6150
temp: 298.150 k
press: 1.00000 atm
elementType: 8 8 6 6 6 6 6 6 6 6 6 6 6 6 6 6 1 1 1 1 1 1 1 1 1 1 1 1
symmnumber: 1
zpe: 576477.5 jmol-1
zpe.correction: 0.219569 hartree
zpe.thermalcorrener: 0.232241 hartree
zpe.thermalcorrenthalpy: 0.233186 hartree
zpe.thermalcorrgfe: 0.177514 hartree
zpe.sumelectzpe: -690.023528 hartree
zpe.sumelectthermal: -690.010855 hartree
zpe.sumelectthermalent: -690.009911 hartree
zpe.sumelectthermalfe: -690.065583 hartree
dipole: -0.6949 -2.2776 -0.0003
dipole: 2.3812
quadrupole: -74.6548 -94.5865 -89.3868
quadrupole: -2.0420 0.0028 -0.0034
quadrupole: 11.5546 -8.3772 -3.1774 -2.0420 0.0028 -0.0034
hfenergy: -690.2430963 hartree
pointgroup: C01 [X(C14H12O2)]
dipole: 0.2774128 -0.8948253 -0.0006249 debye
polarizability: 213.614174|-14.0879569|142.711211|0.0090131|0.0331767|106.5319109 unknown
InChI: InChI=1S/C14H12O2/c15-14(13-9-5-2-6-10-13)16-11-12-7-3-1-4-8-12/h1-10H,11H2
charge 0 multiplicity 1
28 atoms
O  0.055254 0.513427 0.000906
O  -1.280572 2.425855 0.001876
C  2.485035 0.537054 0.000478
C  1.260092 1.415625 0.001015
C  -2.325637 0.215818 0.000706
C  3.069678 0.116528 1.221801
C  3.069377 0.117587 -1.221355
C  -1.180943 1.172349 0.001737
C  4.214059 -0.711217 1.223427
C  4.21376 -0.710152 -1.223981
C  -3.640008 0.752084 0.000674
C  -2.131781 -1.190306 -0.000227
C  4.788533 -1.126821 -0.000527
C  -4.75325 -0.112565 -0.000245
C  -3.249771 -2.050659 -0.001148
C  -4.559847 -1.514944 -0.001164
H  1.196733 2.059436 0.896105
H  1.196421 2.060082 -0.893588
H  2.624767 0.437883 2.171361
H  2.624228 0.439763 -2.170525
H  4.65814 -1.02861 2.173343
H  4.657611 -1.026719 -2.17428
H  -3.7609 1.84044 0.001401
H  -1.112667 -1.586742 -0.000184
H  5.678307 -1.766378 -0.000915
H  -5.767418 0.301076 -0.000253
H  -3.102646 -3.136118 -0.001851
H  -5.425555 -2.186875 -0.001887
