program: Gaussian 09
title: 000111134
version: EM64L-G09RevD.01
frameworkgroup: C1[X(C13H28N4)]
method: RPBEPBE
basis: SDD
operation: Freq
keyword: #pfreq=noraman
keyword: PBEPBE/SDD
title: #p freq=noraman PBEPBE/SDD
converged: YES YES NO NO
title: Mulliken charges:
elementType: N N N N C C C C C C C C C C C C C H H H H H H H H H H H H H H H H H H H H H H H H H H H H
charge: -0.628363 -0.610739 -0.347126 -0.336116 -0.386128 -0.385220 -0.384576 -0.387479 -0.385697 -0.367068 -0.362597 -0.386209 -0.370384 -0.459864 -0.537370 0.125386 0.118995 0.194721 0.194377 0.195962 0.193978 0.194425 0.194121 0.197674 0.191295 0.196915 0.194416 0.201111 0.190389 0.191212 0.193901 0.222238 0.178684 0.215125 0.208347 0.240638 0.208622 0.205402 0.223639 0.311383 0.305118 0.324617 0.305030 0.198775 0.218440
chargesum: 0.00000
title: Mulliken charges with hydrogens summed into heavy atoms:
elementType: N N N N C C C C C C C C C C C C C
charge: -0.011862 0.018909 -0.148351 -0.117677 0.002970 0.004720 0.003970 0.001490 0.005634 0.024431 0.022516 0.014713 0.053089 -0.010604 -0.108330 0.125386 0.118995
polarizability: 2.24634407e+02 -8.61095866e+00 1.52024637e+02 5.74838649e+00 -8.82255615e+00 1.41044295e+02
1716.lowfreq: -9.5965 -0.0017 -0.0005 0.0006 1.0007 5.2692 10.6282 13.3298 19.7744
frequency: 10.2673 13.1407 19.2256 23.3394 31.5982 48.8852 56.5792 63.4536 86.4895 90.8468 106.8102 122.0434 124.6563 146.4560 150.4782 151.4407 177.5138 261.1239 268.0105 316.2551 363.6516 374.8648 394.8594 415.4550 419.2323 440.8126 465.4893 472.8951 514.0086 517.3559 544.3664 634.2606 670.7599 721.8052 723.1872 729.5071 741.9880 766.0786 795.4597 805.5546 837.7769 855.5285 862.7870 869.5598 911.6148 966.2089 980.6189 989.5518 1009.0109 1017.4663 1030.9050 1037.1433 1052.6195 1054.3123 1060.9923 1076.2691 1082.2411 1082.5953 1095.2946 1100.7794 1104.0930 1116.9754 1119.8554 1189.5787 1198.5553 1216.2400 1225.5227 1241.6862 1251.7498 1262.8338 1276.7779 1278.5515 1280.8017 1287.2258 1289.6464 1297.0311 1298.4958 1301.4416 1322.2036 1338.5100 1350.0594 1354.3454 1357.4340 1358.0126 1376.5987 1399.5206 1454.7297 1459.3975 1459.9437 1462.2038 1463.7115 1464.6084 1469.2537 1475.4272 1481.4004 1485.9999 1489.0495 1589.9020 1614.0407 1639.9439 1645.1309 2947.9851 2948.6204 2950.4617 2951.0054 2953.7134 2957.4441 2961.8711 2965.4106 2972.5784 2976.2100 2980.0041 2982.0940 2985.7606 2991.0150 2999.1657 3009.3242 3020.0915 3028.3102 3036.0695 3043.1942 3055.2848 3086.0055 3290.2786 3373.5198 3527.2623 3549.1299 3673.8481 3707.8847
redmass: 3.7171 3.7076 2.8224 5.1384 3.5465 2.1977 2.7139 3.9540 2.1978 2.1775 4.6449 2.0849 2.0916 4.3270 2.0510 2.0686 4.0417 3.6920 3.9435 1.1970 3.1489 3.4511 1.2270 2.1943 2.1763 1.1792 2.9933 2.5885 2.6148 2.3460 1.2529 3.2679 4.7577 1.0620 1.0687 1.0878 1.1212 1.1793 1.1232 1.2377 1.3997 1.3444 3.5932 3.4047 1.3024 1.3086 4.6515 4.5473 2.7818 1.5119 2.2370 1.9763 1.3485 2.9669 2.8152 2.3914 2.0881 2.2035 1.7768 2.6635 1.4869 1.5532 1.3794 1.6664 1.2554 1.4918 1.2876 1.3623 1.2956 1.2694 1.2731 1.1596 1.0568 1.0692 1.1171 1.1090 1.1167 1.2991 1.3477 1.4025 1.4849 1.6847 1.6023 1.6451 3.3256 3.3625 1.0763 1.0732 1.0778 1.0660 1.0812 1.0682 1.0985 1.1018 1.1028 1.1023 1.1021 1.4558 1.5551 2.5145 2.9873 1.0588 1.0588 1.0592 1.0594 1.0597 1.0602 1.0605 1.0603 1.0603 1.0680 1.0612 1.0959 1.0968 1.0986 1.1002 1.1017 1.1022 1.1021 1.1033 1.1037 1.1039 1.0960 1.0755 1.0761 1.0447 1.0453 1.1037 1.1036
irintensity: 0.7412 10.8235 5.4371 0.8023 1.6084 0.6060 2.4938 0.5328 0.5566 1.1564 1.5664 0.2845 0.3498 0.4960 0.0704 0.1990 0.8988 5.2960 0.7112 148.4024 6.8168 1.1096 244.4379 0.5988 31.3739 39.7664 1.0093 3.8553 17.3340 31.3349 129.3701 6.6617 21.2788 14.5011 4.3570 2.6747 1.3079 0.1870 48.4813 1.8197 77.1460 0.7697 0.3952 10.5225 0.4087 1.3497 0.7765 0.4915 5.0859 0.7593 4.9778 3.7657 0.5193 1.5676 4.3092 0.5535 0.0938 0.4025 50.8582 15.2212 137.4517 6.3450 46.5702 5.5374 26.7791 3.3423 0.4035 2.4221 1.2399 3.9154 0.2836 1.6635 0.3631 0.0510 0.9537 0.2380 0.3263 0.5898 1.1079 1.6200 1.0021 0.7614 0.7412 0.5129 112.5330 75.4789 4.8555 0.0778 1.0057 0.3203 0.5343 0.4476 4.1127 0.6139 6.5681 3.2236 42.3710 40.8974 77.6655 216.7863 270.8977 0.3382 0.1724 2.2169 0.0107 1.4106 3.6921 15.1277 212.9593 5.1321 34.7385 91.6251 0.0773 5.3056 0.8584 3.9147 1.2798 3.9874 0.3617 4.4178 214.2300 124.3056 25.3514 44.6611 12.2209 11.9949 31.9341 12.0210 24.8499
temp: 298.150 k
press: 1.00000 atm
elementType: 7 7 7 7 6 6 6 6 6 6 6 6 6 6 6 6 6 1 1 1 1 1 1 1 1 1 1 1 1 1 1 1 1 1 1 1 1 1 1 1 1 1 1 1 1
symmnumber: 1
zpe: 1055258.9 jmol-1
zpe.correction: 0.401927 hartree
zpe.thermalcorrener: 0.424289 hartree
zpe.thermalcorrenthalpy: 0.425233 hartree
zpe.thermalcorrgfe: 0.343790 hartree
zpe.sumelectzpe: -729.784287 hartree
zpe.sumelectthermal: -729.761925 hartree
zpe.sumelectthermalent: -729.760980 hartree
zpe.sumelectthermalfe: -729.842423 hartree
dipole: 1.6448 1.2950 0.4681
dipole: 2.1451
quadrupole: -148.9555 -108.7627 -102.9060
quadrupole: 50.6360 -10.7533 -1.8946
quadrupole: -28.7474 11.4454 17.3021 50.6360 -10.7533 -1.8946
hfenergy: -730.1862134 hartree
pointgroup: C01 [X(C13H28N4)]
dipole: -0.6467471 -0.315852 0.4406645 debye
polarizability: 224.7171577|-10.0674035|156.6327576|0.3911939|-2.0941717|136.3534233 unknown
InChI: InChI=1S/C13H28N4/c14-12(15)10-8-6-4-2-1-3-5-7-9-11-13(16)17/h14,16H,1-11,15,17H2
charge 0 multiplicity 1
45 atoms
N  -8.000015 -1.082733 0.920358
N  8.191296 1.035407 0.890061
N  -8.520712 1.109423 0.023059
N  8.342428 -1.207612 0.272565
C  -0.011375 -0.095487 0.193664
C  -1.303864 0.056078 -0.639542
C  1.277316 0.117997 -0.631785
C  -2.593914 -0.080885 0.200337
C  2.57074 -0.088901 0.187915
C  -3.884377 0.007649 -0.645061
C  3.858295 0.171239 -0.625902
C  -5.174226 -0.062081 0.202926
C  5.148632 -0.064849 0.189836
C  -6.454919 -0.00819 -0.671616
C  6.435985 0.211487 -0.6339
C  -7.750898 0.046012 0.12771
C  7.71197 -0.054467 0.172081
H  -0.030205 0.628702 1.035131
H  0.0105 -1.105363 0.654486
H  -1.301475 1.044544 -1.144852
H  -1.308926 -0.705185 -1.447791
H  1.277982 -0.576822 -1.497928
H  1.271967 1.143484 -1.057281
H  -2.60976 0.71188 0.977068
H  -2.576678 -1.048678 0.744581
H  2.590341 -1.125341 0.584897
H  2.555107 0.581591 1.072792
H  -3.88185 0.955087 -1.222598
H  -3.889108 -0.812624 -1.393547
H  3.845544 1.214821 -1.005322
H  3.864814 -0.484991 -1.521666
H  -5.193064 0.782136 0.919897
H  -5.155975 -0.990129 0.812187
H  5.169129 -1.110575 0.555648
H  5.14075 0.581869 1.090061
H  -6.439064 0.899382 -1.296833
H  -6.472056 -0.883954 -1.352792
H  6.415883 1.257613 -1.000919
H  6.442173 -0.440023 -1.52829
H  -8.830651 -1.137817 1.506645
H  -7.337194 -1.854217 0.957061
H  9.014508 0.902373 1.474512
H  7.765937 1.954048 0.818371
H  -9.380963 1.053478 0.611948
H  7.888072 -1.94288 -0.300872
