program: Gaussian 09
title: 000111123
version: EM64L-G09RevD.01
frameworkgroup: C1[X(C6H12O6)]
method: RPBEPBE
basis: SDD
operation: Freq
keyword: #pfreq=noraman
keyword: PBEPBE/SDD
title: #p freq=noraman PBEPBE/SDD
converged: NO YES NO NO
title: Mulliken charges:
elementType: O O O O O O C C C C C C H H H H H H H H H H H H
charge: -0.466992 -0.469217 -0.489460 -0.472605 -0.457687 -0.203193 -0.160170 -0.044268 -0.129588 -0.150525 -0.388186 -0.053966 0.283011 0.227581 0.231979 0.231402 0.256063 0.222494 0.364560 0.368826 0.198542 0.375370 0.370281 0.355748
chargesum: 0.00000
title: Mulliken charges with hydrogens summed into heavy atoms:
elementType: O O O O O O C C C C C C
charge: -0.102432 -0.100391 -0.114090 -0.102324 -0.101939 -0.203193 0.122841 0.183313 0.102391 0.080876 0.090371 0.144576
polarizability: 1.06275632e+02 7.96722182e-01 7.82126728e+01 2.89444200e+00 2.41518594e+00 7.32329496e+01
1716.lowfreq: -9.1066 -0.0008 0.0009 0.0009 6.3456 15.8094 28.5303 52.0840 66.9105
frequency: 27.8116 51.7496 66.8789 101.0617 111.2077 147.0940 174.7500 239.0540 256.9731 290.0667 297.9827 306.0037 312.7325 331.2188 391.4818 451.3977 484.2335 514.2414 542.1930 613.1556 640.8569 667.2589 709.5225 720.4433 809.3846 831.2730 890.8326 914.3720 933.6156 967.2182 1009.1846 1024.3357 1042.4561 1063.3824 1077.4028 1103.5479 1145.0171 1189.7071 1209.7640 1214.9574 1269.5553 1279.0311 1297.1288 1318.7900 1320.5729 1337.1602 1340.6029 1349.6907 1367.1504 1378.6660 1380.2266 1405.5193 1459.2939 1624.6359 2943.4857 2956.6784 2973.6604 2979.3996 3010.9431 3081.0443 3105.0133 3418.5910 3419.4660 3456.2561 3472.2246 3573.7153
redmass: 5.4269 4.7830 6.6663 5.4591 5.8581 3.6395 4.5819 4.9668 4.0687 5.4798 6.6508 4.0903 3.2812 1.3023 4.9132 1.2266 2.5344 1.1435 3.0684 1.1350 2.7621 1.3343 3.4925 3.0617 3.9666 3.2825 2.3535 2.9111 4.1677 2.7975 2.5684 2.1614 3.7994 3.0276 2.7634 2.3314 1.3969 1.2131 1.5671 1.1802 1.1865 1.2054 1.2382 1.2462 1.3070 1.2090 1.1852 1.1841 1.3335 1.2559 1.4641 1.6498 1.0780 8.4633 1.0814 1.0843 1.0891 1.0843 1.0632 1.0859 1.1033 1.0645 1.0639 1.0648 1.0644 1.0666
irintensity: 6.3990 4.0041 1.7351 0.5218 3.9748 3.4745 6.2976 1.4680 8.3145 47.0768 15.8123 16.1675 33.8854 70.9759 2.2042 122.6043 5.9955 97.2911 11.0928 55.3024 64.2999 243.3598 33.6721 46.4089 53.3560 23.2847 50.2825 26.0215 58.5677 50.8360 19.4058 18.8980 96.9763 4.3642 33.3348 50.7456 54.3340 43.8043 7.8042 54.1688 65.1132 27.7211 37.9101 28.3390 17.2670 33.5504 9.4275 44.6509 23.6244 28.0433 62.0301 12.4367 7.9641 136.5914 7.2459 22.9663 95.6487 48.0062 27.2703 6.3153 12.3772 67.3392 45.5867 53.1137 36.5407 12.3451
temp: 298.150 k
press: 1.00000 atm
elementType: 8 8 8 8 8 8 6 6 6 6 6 6 1 1 1 1 1 1 1 1 1 1 1 1
symmnumber: 1
zpe: 492827.5 jmol-1
zpe.correction: 0.187708 hartree
zpe.thermalcorrener: 0.201359 hartree
zpe.thermalcorrenthalpy: 0.202304 hartree
zpe.thermalcorrgfe: 0.146668 hartree
zpe.sumelectzpe: -686.143408 hartree
zpe.sumelectthermal: -686.129757 hartree
zpe.sumelectthermalent: -686.128812 hartree
zpe.sumelectthermalfe: -686.184448 hartree
dipole: 3.2839 -2.1086 2.1698
dipole: 4.4653
quadrupole: -85.4795 -68.3878 -69.3238
quadrupole: -6.0759 -3.1041 -0.1240
quadrupole: -11.0825 6.0092 5.0732 -6.0759 -3.1041 -0.1240
hfenergy: -686.3311161 hartree
pointgroup: C01 [X(C6H12O6)]
dipole: -1.331146 0.9929979 0.5729535 debye
dipolederiv: -0.8124426 -0.0729807 -0.0796382 -0.142805 -0.7313417 0.0892261 -0.0880763 0.0684194 -0.2922759 -0.602148 0.232118 -0.015953 0.1800327 -0.6865023 -0.0220692 -0.0670997 -0.0215335 -0.5164269 -0.550546 -0.0267178 0.0816119 -0.03059 -0.5025302 -0.0253803 0.1623001 0.0095842 -0.7537432 -0.3700112 -0.0697848 -0.0647731 -0.1455767 -0.5693968 0.1067759 0.0409303 0.1016355 -0.6844069 -0.8778556 0.2963231 -0.0977508 0.301733 -0.2865038 -0.0873855 -0.0618151 -0.0794295 -0.5410466 -0.9004302 -0.1493216 0.0749593 -0.0582081 -0.3052818 0.0542092 0.2721033 0.1273124 -0.5286728 0.4307046 0.2048661 0.0218618 0.1254173 0.3759047 -0.0845683 0.0031581 -0.0167734 0.1733979 0.2721913 -0.1686756 -0.0491412 -0.0249766 0.4258358 0.1202716 -0.158156 0.0214393 0.3085718 0.180646 0.1565723 -0.1054808 0.0540465 0.2532775 -0.0461464 -0.2014893 -0.0602959 0.3973907 -0.3429722 -0.0999538 -0.1141727 0.0750357 0.3023381 -0.01572 -0.1062267 -0.0501932 0.507962 0.5264279 -0.2195983 -0.0600764 -0.2199614 0.3050586 0.0807433 0.0205206 0.0328026 0.2266651 1.2166333 0.19032 -0.0975992 0.0117659 0.1714387 -0.1374292 -0.0703788 -0.1137249 0.5977348 0.0956211 -0.0052419 0.0038457 0.0170777 0.0604458 -0.0118975 -0.0055592 0.0152665 -0.0450412 0.0138385 0.0180979 0.0471209 0.007643 -0.0242879 -0.0127615 0.0556154 -0.0463727 -0.1610699 0.0342807 -0.0599384 0.0025845 -0.1130952 -0.1677544 0.0275864 -0.0085759 -0.0117277 -0.0114273 0.0641973 0.0805754 0.070872 0.0602338 -0.0330626 -0.0788648 0.0180928 -0.0547352 -0.0639675 0.0449798 -0.023046 0.0034342 -0.0370784 -0.0544579 -0.0641292 0.026143 -0.0140048 0.0879374 0.0160827 0.0214839 0.0645411 0.0156139 0.0299367 0.1009453 0.0575254 0.0606572 -0.1010564 0.3685053 -0.055282 0.04338 -0.0497758 0.3853946 -0.0597788 0.0245121 -0.015829 0.1736118 0.3486174 -0.1535076 0.0275403 -0.0905909 0.2563979 -0.007763 0.0549999 0.0029839 0.3422965 0.0224832 0.0052644 -0.0271704 0.0203903 0.1005297 0.0649509 -0.0681613 0.0476169 -0.192183 0.2496988 0.0176573 0.0559347 0.0610508 0.2921984 -0.005877 0.018476 -0.0114434 0.4059538 0.2372514 0.0007012 0.1469902 0.0470629 0.3313697 -0.0161584 0.0060656 -0.0194258 0.3535579 0.3342466 -0.1199311 0.067079 -0.0644452 0.0709933 0.0312203 0.0750958 0.0277713 0.316238 unknown
polarizability: 105.9946993|1.3361468|76.2197123|-3.7886841|-3.6472922|75.5068432 unknown
InChI: InChI=1S/C6H12O6/c7-1-3(9)5(11)6(12)4(10)2-8/h1,3-6,8-12H,2H2
charge 0 multiplicity 1
24 atoms
O  -0.929245 -2.069616 0.020025
O  1.744907 -1.569926 0.226717
O  -2.057654 -0.159881 1.514257
O  1.415466 1.127708 -1.310037
O  -3.981765 0.86387 -0.120938
O  3.929796 0.939921 -0.368681
C  -0.489793 -0.684364 -0.234428
C  0.838174 -0.461233 0.52851
C  -1.610125 0.286301 0.178948
C  1.554209 0.846526 0.107024
C  -2.81189 0.24502 -0.785256
C  3.033731 0.757053 0.489784
H  -0.282515 -0.611821 -1.314492
H  0.627528 -0.419052 1.62055
H  -1.218843 1.322547 0.243929
H  1.105459 1.687884 0.678808
H  -3.112109 -0.797713 -0.976684
H  -2.571094 0.7432 -1.743591
H  -1.452794 -2.019628 0.871397
H  1.176853 -2.386797 0.164728
H  3.265899 0.524111 1.552132
H  -3.007892 0.132966 1.596063
H  2.333559 1.083453 -1.703166
H  -3.946361 1.84787 -0.225098
