program: Gaussian 09
title: 000111108
version: EM64L-G09RevD.01
frameworkgroup: C1[X(C11H8Cl3NO3)]
method: RPBEPBE
basis: SDD
operation: Freq
keyword: #p
keyword: freq=noraman
keyword: PBEPBE/SDD
title: #p freq=noraman PBEPBE/SDD
converged: YES YES NO NO
title: Mulliken charges:
elementType: Cl Cl Cl O O O N C C C C C C C C C C C H H H H H H H H
charge: -0.004499 0.013650 0.019101 -0.300885 -0.231961 -0.152617 -0.357351 -0.195220 -0.443595 -0.514761 0.158912 0.205038 0.580504 -0.299776 -0.326661 -0.059925 -0.190402 -0.096603 0.277891 0.251003 0.250939 0.258287 0.260559 0.326270 0.284448 0.287653
chargesum: 0.00000
title: Mulliken charges with hydrogens summed into heavy atoms:
elementType: Cl Cl Cl O O O N C C C C C C C C C C C
charge: -0.004499 0.013650 0.019101 -0.300885 -0.231961 -0.152617 -0.031080 0.082671 0.058347 0.004085 0.158912 0.205038 0.580504 -0.299776 -0.042213 -0.059925 0.097251 -0.096603
polarizability: 2.40485585e+02 -1.75287744e+01 1.51528358e+02 3.01154052e+00 4.76216718e+00 9.63177840e+01
1716.lowfreq: -5.3130 0.0015 0.0022 0.0030 2.4733 4.4785 14.9615 33.0367 43.4660
frequency: 14.7920 33.0175 43.4544 47.3911 70.2247 97.2467 117.9233 158.5451 166.6990 178.5660 199.1560 224.9092 253.7526 287.8618 309.5193 313.0843 358.6442 407.1562 446.2645 451.3051 495.7546 498.8592 546.4626 581.6391 582.0806 627.2303 642.3252 647.5316 674.0621 681.7348 716.0450 757.7253 799.7407 834.7073 857.5322 863.2066 883.1166 894.9729 930.1735 1002.9601 1021.0928 1033.0523 1060.0730 1105.1338 1107.3645 1150.7516 1177.1295 1203.4137 1227.2134 1227.5109 1258.1669 1277.4171 1321.5821 1329.2379 1345.2511 1362.4413 1382.8506 1439.4462 1454.2493 1477.4800 1564.0923 1580.4886 1678.3448 1691.4074 3022.7115 3028.6348 3042.1891 3097.9136 3113.7108 3182.2392 3184.6463 3572.3359
redmass: 7.2670 12.5354 5.5407 15.4574 12.2451 8.6326 3.8999 10.0186 5.1476 25.5684 6.0114 6.8091 6.8281 7.3778 5.8522 21.3067 11.5880 12.0474 3.3036 5.2134 2.5849 2.6525 7.2656 4.9979 3.6464 3.0151 5.2381 5.4132 6.3630 4.1920 5.0669 4.6114 3.1247 3.3020 1.5197 5.2624 1.5993 2.7925 3.1546 2.4208 3.6083 4.3649 2.6427 1.9826 1.8502 1.2587 1.3713 5.5783 1.5881 1.3113 1.9823 1.4097 1.4670 7.1411 1.6547 10.5516 1.7716 3.1617 1.0848 1.0888 10.5054 8.0899 8.9037 11.5354 1.0644 1.0770 1.0717 1.0987 1.1039 1.0928 1.0936 1.0788
irintensity: 1.5910 0.6258 0.7194 0.2845 1.2747 0.6483 2.9671 0.6606 1.3236 0.4955 0.5823 0.0387 1.2915 7.1172 10.0056 1.5617 1.2762 2.7963 17.4962 7.2239 26.3724 26.9865 27.1417 8.0520 27.6205 73.3472 12.6841 2.6724 24.9241 1.8910 33.5681 18.1709 9.2788 49.8366 4.1110 12.8618 38.3866 22.2364 52.1562 45.4973 376.9665 74.1284 244.1063 15.4365 51.6821 7.5021 6.9732 35.5009 63.0234 12.4485 56.5934 4.2779 5.4065 25.2938 11.8021 7.2047 31.9734 241.8059 10.0194 10.7714 0.8708 6.6028 449.7204 156.1037 8.9956 10.8796 24.9250 5.0763 16.1995 2.4494 0.6797 32.3041
temp: 298.150 k
press: 1.00000 atm
elementType: 17 17 17 8 8 8 7 6 6 6 6 6 6 6 6 6 6 6 1 1 1 1 1 1 1 1
symmnumber: 1
zpe: 451093.5 jmol-1
zpe.correction: 0.171812 hartree
zpe.thermalcorrener: 0.188832 hartree
zpe.thermalcorrenthalpy: 0.189777 hartree
zpe.thermalcorrgfe: 0.123463 hartree
zpe.sumelectzpe: -2083.277652 hartree
zpe.sumelectthermal: -2083.260632 hartree
zpe.sumelectthermalent: -2083.259688 hartree
zpe.sumelectthermalfe: -2083.326002 hartree
dipole: 1.8733 -0.2860 -4.0276
dipole: 4.4512
quadrupole: -154.6077 -113.0250 -130.4341
quadrupole: 1.9400 18.2386 1.8531
quadrupole: -21.9188 19.6639 2.2548 1.9400 18.2386 1.8531
hfenergy: -2083.4494646 hartree
pointgroup: C01 [X(C11H8Cl3N1O3)]
dipole: 0.7460215 0.0143841 1.5843098 debye
dipolederiv: -0.4481009 -0.2952548 0.0302475 -0.334595 -0.3944618 -0.0038757 0.0154324 -0.010958 -0.0287579 -0.3943733 -0.3169047 -0.0225184 -0.3930669 -0.4220045 -0.0392783 -0.0204586 -0.0377982 -0.0213501 -0.6909175 0.1254115 0.1548148 0.1791641 -0.087675 -0.0511421 0.1957119 -0.0479657 -0.0608808 -2.2157329 0.2066123 -0.2623957 0.2797465 -0.2683231 0.0129046 -0.3141237 0.0303705 -0.5369429 -1.0869265 -0.0546436 -0.3913607 0.0629108 -0.4806632 0.1018881 -0.5901265 0.0063743 -0.6871233 -0.6844202 0.0113381 0.1325048 0.0628339 -0.2142996 -0.0034228 -0.3566654 0.1434813 -0.8138387 -1.0675699 -0.090443 -0.1722307 -0.4151759 -0.5912087 -0.2702997 -0.2324982 -0.1481784 -0.5234799 0.4531484 -0.1045529 0.1576857 -0.4099202 0.1228904 0.0309945 0.3672307 0.0980209 0.2417488 0.0976826 -0.0156359 -0.0358669 0.1661157 0.0418598 -0.0108492 -0.053364 -0.0016744 0.1125489 -0.0152562 0.0719633 -0.1176393 0.0922279 -0.2423095 0.1757992 -0.1155432 0.147786 -0.0399012 1.4529339 0.2392237 0.7006236 0.5069172 0.9159251 0.0369708 0.8142591 -0.0370749 0.6911421 2.0120511 -0.1234918 0.0979613 -0.1404329 0.141788 -0.0048978 0.9073435 -0.2532977 1.1787618 1.1299451 -0.2692574 -0.0293474 -0.2990477 0.1176144 0.0119363 -0.4024221 0.0686423 0.049561 0.4230332 0.4896404 -0.0586597 0.555963 0.5411982 0.0093986 0.0562624 0.0331854 -0.0499687 -0.3201155 -0.0664025 -0.044097 -0.1020242 -0.1508442 0.0083931 0.0129115 -0.0123105 -0.0570405 0.3758334 0.6169511 0.0833095 0.6159399 0.6245381 0.0638338 0.0696128 0.0386787 -0.0421815 -0.3500743 -0.0212435 0.0649529 -0.086115 -0.1232131 0.0091995 0.0552678 -0.0116083 -0.0318951 0.9306524 -0.3670614 -0.296182 -0.3084094 -0.0085637 0.0695288 -0.3094454 0.0951058 0.0236511 -0.0180824 -0.0326236 -0.0483837 -0.015774 0.0150294 -0.0796896 -0.083529 -0.0787287 -0.0062845 -0.019427 -0.0125292 0.1012022 -0.0279671 0.0616987 -0.0429714 0.0794389 -0.0240296 -0.0840549 0.0126067 0.0834588 -0.0772967 0.0955806 0.0170372 0.0216746 -0.0783569 0.0075079 0.0728977 -0.0435944 -0.0893797 0.040571 -0.080913 0.0623895 0.0225089 0.0209443 0.0407976 0.0729588 0.0734975 0.0743101 0.0364894 0.0362139 0.0353181 -0.0589794 0.0313593 -0.0581632 -0.0107374 0.2146798 -0.0743338 -0.0868946 -0.0707705 0.1950135 0.0515081 -0.1175907 0.0708456 0.2413188 0.0956028 0.0156058 0.03103 0.0249085 0.0435094 -0.0306561 0.0269787 -0.0287855 0.1525489 0.0829242 -0.0007571 0.0114802 0.0056896 0.0477568 -0.0304765 0.0213703 -0.0302232 0.1572995 unknown
polarizability: 239.0307983|21.0329751|151.8640079|-2.7585506|8.8583905|97.4369203 unknown
InChI: InChI=1S/C11H8Cl3NO3/c12-5-3-7(14)9(4-6(5)13)18-11(17)8-1-2-10(16)15-8/h3-4,8,15H,1-2H2
charge 0 multiplicity 1
26 atoms
Cl 0.299369 -2.47075 0.051913
Cl 4.696701 2.211807 0.240362
Cl 5.519333 -0.825176 -0.737192
O  -0.138347 0.460103 0.94007
O  -5.429441 0.276242 -1.346633
O  -0.987458 0.543268 -1.255923
N  -3.595391 1.172249 -0.163921
C  -2.51197 0.75329 0.717372
C  -3.034533 -0.62259 1.278828
C  -4.019679 -1.121892 0.196061
C  -4.471201 0.150456 -0.544754
C  -1.184805 0.580203 -0.035472
C  1.173137 0.155894 0.49218
C  1.533151 -1.147054 0.081766
C  2.148155 1.169984 0.53592
C  3.476796 0.883953 0.166878
C  2.856341 -1.437726 -0.294213
C  3.830185 -0.418201 -0.251201
H  -2.332789 1.46434 1.543283
H  -3.566026 -0.427597 2.225381
H  -2.206171 -1.317212 1.484919
H  -4.895062 -1.649307 0.605876
H  -3.536057 -1.792829 -0.537527
H  -3.625384 2.084432 -0.621022
H  1.862914 2.174344 0.858652
H  3.132831 -2.445132 -0.614303
