program: Gaussian 09
title: 000002343
version: EM64L-G09RevD.01
frameworkgroup: C1[X(C15H14ClN3O4S3)]
method: RPBEPBE
basis: SDD
operation: Freq
keyword: #p
keyword: freq=noraman
keyword: PBEPBE/SDD
title: #p freq=noraman PBEPBE/SDD
converged: YES YES NO NO
title: Mulliken charges:
elementType: Cl S S S O O O O N N N C C C C C C C C C C C C C C C H H H H H H H H H H H H H H
charge: 0.018144 0.895592 0.952310 0.143756 -0.490502 -0.512722 -0.528938 -0.500912 -0.435653 -0.241691 -0.711788 -0.295490 0.689327 -0.226260 -0.006413 0.226176 -0.382007 -0.080698 -0.771047 -0.845047 0.521197 -0.382116 -0.389586 -0.223919 -0.222123 -0.246780 0.336430 0.333229 0.280172 0.300491 0.302829 0.278192 0.280938 0.350172 0.338513 0.236943 0.268487 0.230593 0.273482 0.236718
chargesum: 0.00000
title: Mulliken charges with hydrogens summed into heavy atoms:
elementType: Cl S S S O O O O N N N C C C C C C C C C C C C C C C
charge: 0.018144 0.895592 0.952310 0.143756 -0.490502 -0.512722 -0.528938 -0.500912 -0.102424 -0.241691 -0.023102 -0.295490 0.689327 0.110170 -0.006413 0.226176 -0.101835 -0.080698 -0.167726 -0.285917 0.521197 -0.145174 -0.121099 0.006674 0.051359 -0.010062
polarizability: 3.39348850e+02 1.77633829e+01 2.78889713e+02 -3.64557633e+01 1.50646865e+01 2.15190771e+02
1716.lowfreq: -10.5564 -3.3048 0.0016 0.0021 0.0025 2.2169 7.3787 19.5420 25.7091
frequency: -6.3200 18.8314 25.6831 47.5185 54.1145 62.9275 71.3874 80.8333 87.5431 99.9096 118.4444 132.7486 140.7485 154.7720 162.8485 188.9776 203.0546 214.3987 217.5750 229.2984 251.4058 270.2771 275.6176 289.0311 293.7800 315.9114 332.6446 341.1132 373.3767 395.2124 405.0182 405.4307 432.4369 449.2979 459.1165 460.4702 474.9004 492.3869 515.8627 547.2709 565.9546 599.9822 610.3266 616.1179 651.4371 660.4809 706.8328 722.5534 732.2758 745.6205 748.5041 776.2530 786.7451 804.7307 809.8163 822.6123 841.7721 860.5897 878.1144 893.7402 913.2564 919.0680 933.2736 933.7495 956.3651 971.0436 984.4133 989.3739 1006.7453 1018.6615 1025.3112 1074.0638 1080.9436 1098.5641 1140.2541 1174.7211 1179.0545 1189.5828 1191.5639 1219.2496 1226.5920 1230.5824 1251.1567 1270.5406 1327.6770 1333.6240 1382.8055 1401.8041 1416.6837 1440.7642 1445.7253 1447.6361 1482.5558 1488.5551 1528.7480 1535.3427 1573.0377 1590.2791 1600.0453 1609.5314 3034.0513 3037.6314 3109.3283 3117.4086 3126.0248 3129.9044 3131.4799 3137.3555 3154.4900 3158.5615 3173.0595 3354.2275 3378.1712 3548.8947
redmass: 7.0191 4.1584 10.4231 6.4303 7.1193 9.3509 4.5162 10.2269 7.6111 8.7246 6.5958 3.7275 4.7010 3.1459 7.4569 10.7776 4.4737 9.1245 5.8733 5.4693 6.0435 4.8144 3.7704 6.2343 7.3851 9.9141 2.6242 3.7723 12.7226 10.6026 2.8705 6.9725 8.9290 7.6687 4.1966 4.4155 3.5037 6.7054 8.0814 5.8207 5.3126 6.7527 4.7346 6.1019 7.7308 6.6845 1.8060 4.1271 2.2448 2.2861 2.2999 1.9527 1.8099 3.8712 11.7791 16.9408 1.6451 1.2748 3.4810 2.2752 1.9205 3.9950 1.4280 1.4242 14.4749 7.1369 1.3934 5.9308 1.3478 6.4616 2.1231 1.5407 1.5608 2.0086 1.1009 1.0670 1.1314 2.1213 1.2988 1.8589 1.5653 1.2868 1.2148 2.4922 1.2785 5.5626 8.4293 8.6381 1.0973 2.1726 2.5510 1.2230 2.3284 3.5816 1.0872 3.7709 4.6661 5.9826 8.2511 6.0982 1.0599 1.0604 1.1069 1.0879 1.1020 1.0922 1.0889 1.0912 1.0960 1.0932 1.0999 1.0776 1.0412 1.1012
irintensity: 0.0316 0.5044 0.5891 2.6480 2.6867 0.6257 0.7342 2.6533 1.2007 0.5058 2.0262 7.5821 9.3806 5.8614 5.5957 1.8320 1.9349 4.0558 11.4303 0.0748 1.2658 9.5124 1.6180 16.7857 4.4939 4.3303 3.0516 8.5682 8.7908 82.8835 0.3277 24.4239 44.9482 10.7921 7.8063 69.3104 66.5362 14.2800 8.0845 4.1769 9.5724 29.7109 50.1446 4.8472 3.4536 5.9540 74.9621 21.1043 17.2147 30.4863 6.9202 49.6994 172.9446 20.4771 45.1847 95.2875 7.0990 10.3305 55.6099 58.4309 6.0828 69.2998 12.5287 9.9598 100.9919 24.1565 0.5247 0.5387 0.7002 3.4306 2.2838 10.8116 7.4790 27.5877 5.7023 2.3027 9.2209 7.0093 1.8720 4.8929 16.1555 18.0310 2.9136 0.8416 0.5936 61.3914 0.1670 14.2048 42.9672 9.3043 58.2465 8.1290 5.3227 309.0767 37.4064 140.3157 96.5811 1.1827 101.1818 0.2715 12.0435 5.8770 2.0495 5.2109 0.5552 24.6126 5.3954 8.9624 20.1859 0.9839 6.3328 231.2831 39.2525 29.7407
temp: 298.150 k
press: 1.00000 atm
elementType: 17 16 16 16 8 8 8 8 7 7 7 6 6 6 6 6 6 6 6 6 6 6 6 6 6 6 1 1 1 1 1 1 1 1 1 1 1 1 1 1
symmnumber: 1
zpe: 712377.2 jmol-1
zpe.correction: 0.271330 hartree
zpe.thermalcorrener: 0.296944 hartree
zpe.thermalcorrenthalpy: 0.297888 hartree
zpe.thermalcorrgfe: 0.214565 hartree
zpe.sumelectzpe: -2697.137753 hartree
zpe.sumelectthermal: -2697.112140 hartree
zpe.sumelectthermalent: -2697.111195 hartree
zpe.sumelectthermalfe: -2697.194519 hartree
dipole: 4.5395 -8.3153 -1.5580
dipole: 9.6009
quadrupole: -179.4611 -197.8660 -183.5347
quadrupole: 12.7003 -19.3517 -9.9045
quadrupole: 7.4928 -10.9121 3.4193 12.7003 -19.3517 -9.9045
hfenergy: -2697.4090835 hartree
pointgroup: C01 [X(C15H14Cl1N3O4S3)]
dipole: -2.8167345 1.050046 -2.2872327 debye
polarizability: 302.3540506|60.0269644|277.0794002|18.3309753|-34.668397|253.9958832 unknown
InChI: InChI=1S/C15H14ClN3O4S3/c16-11-6-12-14(7-13(11)25(17,20)21)26(22,23)19-15(18-12)9-24-8-10-4-2-1-3-5-10/h1-7,18H,8-9,17H2
charge 0 multiplicity 1
40 atoms
Cl 1.875562 1.958942 -3.077407
S  0.562285 -1.520252 2.220738
S  4.101276 1.871393 -0.497636
S  -3.815577 -2.601619 -1.018413
O  1.861896 -2.310902 2.763941
O  -0.206552 -0.479865 3.206318
O  4.710741 1.607197 0.98672
O  4.949084 1.568835 -1.845526
N  -1.009125 -1.482109 -0.478146
N  -0.7646 -2.756578 1.611144
N  3.523412 3.606032 -0.505008
C  1.014035 -0.613162 0.634916
C  0.120841 -0.654009 -0.465212
C  2.19241 0.146041 0.610595
C  2.466204 0.91025 -0.532739
C  -1.333083 -2.462697 0.449179
C  0.410962 0.148527 -1.600957
C  1.573502 0.930826 -1.622121
C  -2.47764 -3.3976 0.050107
C  -4.730732 -1.506936 0.293458
C  -4.107943 -0.15186 0.513454
C  -4.400148 0.92285 -0.369401
C  -3.214963 0.073001 1.593305
C  -3.807277 2.189982 -0.17914
C  -2.612301 1.337431 1.780026
C  -2.908884 2.399648 0.89523
H  2.896004 0.156561 1.45289
H  -1.704797 -1.372372 -1.233793
H  -0.265629 0.151542 -2.461161
H  -2.925502 -3.824676 0.958695
H  -2.08055 -4.222551 -0.5673
H  -4.766592 -2.118221 1.209877
H  -5.745442 -1.443772 -0.132572
H  3.955119 4.092137 0.297919
H  3.728698 4.033361 -1.421704
H  -5.096084 0.765824 -1.203198
H  -2.978937 -0.734154 2.297255
H  -4.04841 3.013362 -0.860902
H  -1.910738 1.473238 2.608839
H  -2.447221 3.382354 1.041831
