program: Gaussian 09
title: 000111102
version: EM64L-G09RevD.01
frameworkgroup: C1[X(C8H19NS)]
method: RPBEPBE
basis: SDD
operation: Freq
keyword: #p
keyword: freq=noraman
keyword: PBEPBE/SDD
title: #p freq=noraman PBEPBE/SDD
converged: YES YES NO NO
title: Mulliken charges:
elementType: S N C C C C C C C C H H H H H H H H H H H H H H H H H H H
charge: -0.058854 -0.127970 -0.045724 -0.033298 -0.307685 -0.690248 -0.685341 -0.698046 -0.689022 -0.697371 0.199293 0.197881 0.221687 0.217498 0.217645 0.211169 0.209238 0.228551 0.208294 0.202123 0.212628 0.205586 0.237131 0.227195 0.202505 0.209746 0.256817 0.269946 0.098625
chargesum: 0.00000
title: Mulliken charges with hydrogens summed into heavy atoms:
elementType: S N C C C C C C C C
charge: 0.039772 -0.127970 0.153569 0.164583 0.131500 -0.052196 -0.046373 -0.042702 -0.049575 -0.170608
polarizability: 1.34304065e+02 -2.88066079e-01 1.04311825e+02 1.15244302e-01 -1.50891041e+00 1.00729553e+02
1716.lowfreq: -14.5705 -5.4320 0.0016 0.0018 0.0023 11.5823 46.6225 60.7256 71.3571
frequency: 44.9672 60.3556 71.1902 91.7052 123.2018 163.8028 175.8410 194.5406 208.8779 235.3199 243.8199 268.0012 273.2402 285.3095 324.4219 370.6609 389.9557 477.1692 507.7634 555.0767 662.7873 709.2633 766.7948 800.2716 834.2763 877.2512 902.5788 904.6525 923.1143 928.9628 959.7354 1021.4821 1046.2482 1077.0891 1116.4510 1119.0042 1128.5652 1155.5385 1162.9742 1210.6298 1229.4555 1247.3611 1294.3385 1300.0498 1304.8875 1354.7141 1367.3237 1369.8439 1374.4035 1381.0477 1389.7115 1393.5490 1445.7756 1458.4904 1461.6197 1464.8155 1470.3694 1474.4166 1478.7442 1481.5069 1486.8382 1488.7509 2448.7838 2912.3783 2972.0559 2972.6733 2976.3238 2979.7641 2980.4340 3002.7847 3029.7989 3045.0011 3061.4687 3065.0321 3071.3579 3071.9873 3077.1154 3087.3621 3089.8779 3095.3000 3111.3487
redmass: 3.5509 2.8838 2.8079 2.1856 2.6707 1.0766 3.4696 1.1543 1.1203 1.8079 1.2729 1.7087 1.4907 2.4930 2.6268 2.5836 2.1897 2.9164 2.9911 2.4766 3.8970 2.7735 1.1620 1.2830 2.3442 2.3636 1.2723 1.3488 1.3350 1.3066 1.6244 1.4410 2.1713 2.8744 2.2145 1.6574 2.0156 2.0516 1.9739 2.5837 1.5662 1.4519 1.1884 1.3515 1.3459 1.2995 1.3333 1.2155 1.2166 1.2789 1.2194 1.2445 1.0818 1.0527 1.0495 1.0616 1.0557 1.0563 1.0484 1.0575 1.0512 1.0541 1.0386 1.0699 1.0353 1.0361 1.0819 1.0363 1.0376 1.0838 1.0580 1.0884 1.0992 1.0995 1.0988 1.0987 1.0994 1.0998 1.1000 1.0984 1.1099
irintensity: 0.1907 0.1286 2.5294 1.1598 2.0839 27.7285 2.7653 0.2936 0.6147 4.4178 1.4492 0.5313 0.1400 1.7376 0.0407 0.2681 0.5620 9.1631 7.0083 7.8081 22.0350 13.3924 7.5026 3.2914 0.7740 4.9221 2.4767 0.7306 0.7197 0.1152 6.2981 5.4725 11.5617 24.4064 0.3170 26.8956 24.7171 67.8642 26.7783 60.2971 37.6441 22.2354 11.0925 7.3066 1.6196 4.0384 12.4124 0.0557 45.3865 7.5147 14.9832 29.9832 10.0186 0.6678 1.3744 0.3881 7.9127 2.0918 20.3445 7.5351 13.4983 6.3599 35.0660 42.1475 29.9692 23.8378 21.7922 30.2514 16.9992 15.6391 18.0320 18.4949 3.0933 6.1420 74.8503 59.7048 98.6676 25.4250 46.5609 31.8227 28.5428
temp: 298.150 k
press: 1.00000 atm
elementType: 16 7 6 6 6 6 6 6 6 6 1 1 1 1 1 1 1 1 1 1 1 1 1 1 1 1 1 1 1
symmnumber: 1
zpe: 670756.6 jmol-1
zpe.correction: 0.255478 hartree
zpe.thermalcorrener: 0.269762 hartree
zpe.thermalcorrenthalpy: 0.270706 hartree
zpe.thermalcorrgfe: 0.214551 hartree
zpe.sumelectzpe: -768.175607 hartree
zpe.sumelectthermal: -768.161323 hartree
zpe.sumelectthermalent: -768.160379 hartree
zpe.sumelectthermalfe: -768.216534 hartree
dipole: -1.7277 -0.3667 0.9318
dipole: 1.9969
quadrupole: -75.6141 -71.8790 -73.7011
quadrupole: -1.2615 5.3570 -0.7779
quadrupole: -1.8827 1.8524 0.0303 -1.2615 5.3570 -0.7779
hfenergy: -768.431085 hartree
pointgroup: C01 [X(C8H19N1S1)]
dipole: 0.6874688 -0.2076622 -0.3186196 debye
polarizability: 133.5897666|-3.7033063|104.5388463|3.0846513|1.3830674|101.2168299 unknown
InChI: InChI=1S/C8H19NS/c1-7(2)9(5-6-10)8(3)4/h7-8,10H,5-6H2,1-4H3
charge 0 multiplicity 1
29 atoms
S  -3.944221 0.300411 0.04154
N  0.196229 -0.089145 -0.044875
C  0.602805 -1.52072 0.006414
C  1.233652 0.961281 0.139769
C  -1.163537 0.196263 0.444737
C  1.220676 -1.972485 1.36193
C  1.528335 -1.897766 -1.174447
C  1.401167 1.477872 1.600635
C  0.984201 2.14813 -0.823656
C  -2.198325 0.01933 -0.686556
H  -0.338189 -2.092471 -0.128456
H  2.193254 0.494165 -0.155515
H  -1.222841 1.236458 0.81247
H  -1.446046 -0.45622 1.302863
H  0.565565 -1.697384 2.209117
H  1.358427 -3.070092 1.378376
H  2.211114 -1.507908 1.522374
H  1.063132 -1.605614 -2.131909
H  1.715815 -2.987542 -1.185492
H  2.511126 -1.395466 -1.101591
H  2.256993 2.176285 1.661343
H  0.50345 2.027831 1.940216
H  1.582028 0.648263 2.305071
H  0.956154 1.793882 -1.868632
H  1.779125 2.911533 -0.726442
H  0.0183 2.64122 -0.602922
H  -2.155498 -0.999813 -1.104904
H  -2.016288 0.755137 -1.485723
H  -4.628203 0.166568 -1.155432
