program: Gaussian 09
title: 000111090
version: EM64L-G09RevD.01
frameworkgroup: C1[X(C15H14N2)]
method: RPBEPBE
basis: SDD
operation: Freq
keyword: #pfreq=noraman
keyword: PBEPBE/SDD
title: #p freq=noraman PBEPBE/SDD
converged: YES YES NO NO
title: Mulliken charges:
elementType: N N C C C C C C C C C C C C C C C H H H H H H H H H H H H H H
charge: -0.050063 -0.050141 -0.484425 0.250028 0.250204 -0.211820 -0.211923 -0.350082 -0.365657 -0.365647 -0.350255 -0.215854 -0.201075 -0.201082 -0.215801 -0.247455 -0.247465 0.276073 0.217444 0.212402 0.212384 0.237626 0.253476 0.253487 0.237660 0.225569 0.229124 0.229126 0.225569 0.229287 0.229287
chargesum: 0.00000
title: Mulliken charges with hydrogens summed into heavy atoms:
elementType: N N C C C C C C C C C C C C C C C
charge: -0.050063 -0.050141 0.009093 0.250028 0.250204 0.000581 0.000461 -0.112457 -0.112181 -0.112160 -0.112595 0.009715 0.028048 0.028045 0.009768 -0.018169 -0.018178
polarizability: 2.90803611e+02 8.46320638e-02 1.61302071e+02 -2.15648697e-02 -1.95285457e+01 1.16815219e+02
1716.lowfreq: -7.2774 -3.9407 -2.1259 -0.0004 -0.0003 0.0003 13.8637 21.4569 31.9531
frequency: 13.8619 21.4213 31.9231 82.6068 102.7407 103.8094 136.2450 169.6597 225.9373 266.4469 277.2021 386.8201 398.4407 407.9400 411.6999 429.3690 441.4673 514.9663 550.2415 574.6429 612.5091 612.5710 620.5420 695.8422 696.1399 762.9353 768.7925 779.4884 800.6226 837.3038 837.7339 844.7049 903.0649 909.5571 927.7497 967.8276 968.0083 984.3309 984.8869 990.0627 990.1443 1007.1633 1018.4017 1021.3396 1040.6767 1078.9306 1079.2003 1115.8801 1167.8504 1168.4667 1172.5953 1173.2296 1179.4335 1198.5525 1199.1464 1265.7374 1308.3300 1308.6435 1360.3067 1363.3909 1378.6182 1378.8474 1426.9958 1437.3346 1437.7072 1472.6024 1473.3024 1579.9292 1580.1349 1599.9163 1603.2893 1632.5130 1653.0577 2925.6669 2932.3381 2944.7619 3099.0888 3121.9436 3122.0224 3132.0220 3132.0442 3143.3713 3143.4125 3157.0490 3157.1027 3169.8039 3169.8990
redmass: 4.7130 3.6717 4.9060 5.7182 4.8977 4.0666 3.4055 2.6004 3.3204 3.5914 5.1057 4.8131 3.0838 2.9522 2.9310 5.0313 3.2544 3.1391 3.5352 5.1640 6.3875 6.4543 4.7700 1.8655 1.8327 1.8322 1.7904 2.7226 4.6427 1.3058 1.2493 2.1998 1.3628 1.4622 1.4641 1.3775 1.3747 5.5689 5.6342 1.3230 1.3216 1.9131 2.3746 2.0809 2.4286 1.5539 1.5259 4.1878 1.2159 1.1629 1.1820 1.1925 1.2420 2.2709 1.8847 1.3616 1.3607 1.3604 1.4223 1.6309 4.8727 4.7817 1.0905 2.3453 2.3139 2.2663 2.2909 6.0564 6.0643 6.4510 6.2855 7.0760 8.2135 1.0856 1.0792 1.0744 1.0912 1.0853 1.0853 1.0875 1.0875 1.0933 1.0933 1.0960 1.0959 1.1006 1.1006
irintensity: 0.1144 0.0157 0.2719 2.3219 0.0598 6.2914 1.1556 27.0884 2.7615 1.0202 8.7117 6.1536 5.7773 5.1839 2.8218 1.0377 8.5962 1.0823 13.0295 1.5585 0.2080 0.0058 3.0498 18.9001 66.6921 103.3287 102.1249 6.2476 6.7925 2.1915 0.9391 6.6670 31.0823 8.5556 14.8248 0.4853 0.2720 0.7514 0.1442 0.2018 0.7667 6.3201 36.5084 3.2581 50.5171 19.5952 0.4301 13.5917 0.1058 2.0384 0.0356 2.1422 4.4296 3.0399 9.0109 0.0759 0.2948 0.2123 4.0684 13.9069 0.0506 0.1946 19.2645 1.3005 9.5282 9.9292 41.9758 0.3244 8.2415 122.3252 7.5051 171.9618 14.4144 1.2422 77.3983 37.5090 4.3354 6.9224 4.0370 0.7441 1.2998 10.6704 38.5320 28.0655 29.8361 24.7497 10.9948
temp: 298.150 k
press: 1.00000 atm
elementType: 7 7 6 6 6 6 6 6 6 6 6 6 6 6 6 6 6 1 1 1 1 1 1 1 1 1 1 1 1 1 1
symmnumber: 1
zpe: 647624.2 jmol-1
zpe.correction: 0.246667 hartree
zpe.thermalcorrener: 0.261560 hartree
zpe.thermalcorrenthalpy: 0.262504 hartree
zpe.thermalcorrgfe: 0.201116 hartree
zpe.sumelectzpe: -688.270451 hartree
zpe.sumelectthermal: -688.255558 hartree
zpe.sumelectthermalent: -688.254614 hartree
zpe.sumelectthermalfe: -688.316001 hartree
dipole: -0.0010 -1.4215 2.6261
dipole: 2.9861
quadrupole: -89.4248 -87.6516 -104.6979
quadrupole: 0.0262 0.0000 -4.7000
quadrupole: 4.5000 6.2732 -10.7731 0.0262 0.0000 -4.7000
hfenergy: -688.5171176 hartree
pointgroup: C01 [X(C15H14N2)]
dipole: 0.0026193 -0.2790291 -1.1412188 debye
polarizability: 290.8022658|-0.3429174|148.8635702|0.3680477|27.927933|129.2550647 unknown
InChI: InChI=1S/C15H14N2/c1-3-8-14(9-4-1)16-12-7-13-17-15-10-5-2-6-11-15/h1-6,8-13H,7H2
charge 0 multiplicity 1
31 atoms
N  -2.208988 -0.467721 0.836349
N  2.202149 -0.472692 0.84639
C  -0.004456 -1.545981 0.750348
C  -3.429165 -0.013598 0.249641
C  3.426617 -0.022441 0.265441
C  -1.260677 -0.986833 0.112381
C  1.256755 -0.99135 0.118315
C  -4.100731 -0.717433 -0.789986
C  4.010702 1.157599 0.798543
C  -4.014612 1.165364 0.783481
C  4.103338 -0.731262 -0.7673
C  -5.323094 -0.228631 -1.299385
C  5.225736 1.645845 0.276391
C  -5.225607 1.657637 0.255629
C  5.329757 -0.2464 -1.270899
C  -5.885587 0.964251 -0.788022
C  5.891036 0.947428 -0.760561
H  -0.006661 -1.341586 1.832309
H  -0.006002 -2.650424 0.608002
H  -1.314919 -1.035814 -0.998521
H  1.317309 -1.043343 -0.992125
H  -3.683693 -1.659279 -1.166509
H  3.492288 1.673423 1.613032
H  -3.50042 1.677422 1.603006
H  3.687189 -1.673834 -1.142947
H  -5.841675 -0.782741 -2.090126
H  5.661018 2.564656 0.68487
H  -5.661981 2.575587 0.664866
H  5.852363 -0.804411 -2.056228
H  -6.834544 1.340047 -1.185835
H  6.843054 1.320117 -1.153949
