program: Gaussian 09
title: 000111063
version: EM64L-G09RevD.01
frameworkgroup: C1[X(C12H14N4)]
method: RPBEPBE
basis: SDD
operation: Freq
keyword: #pfreq=noraman
keyword: PBEPBE/SDD
title: #p freq=noraman PBEPBE/SDD
converged: YES YES NO NO
title: Mulliken charges:
elementType: N N N N C C C C C C C C C C C C H H H H H H H H H H H H H H
charge: -0.427561 -0.427535 -0.536021 -0.536057 0.359824 0.359826 -0.379801 -0.379803 -0.390129 -0.390126 0.478730 0.478716 -0.441374 -0.441378 -0.444270 -0.444255 0.229589 0.229588 0.227923 0.227923 0.213685 0.213685 0.223132 0.223138 0.304124 0.304118 0.291796 0.290350 0.291805 0.290357
chargesum: 0.00000
title: Mulliken charges with hydrogens summed into heavy atoms:
elementType: N N N N C C C C C C C C C C C C
charge: -0.123437 -0.123417 0.046126 0.046105 0.359824 0.359826 -0.150212 -0.150215 -0.162206 -0.162203 0.478730 0.478716 -0.227689 -0.227693 -0.221138 -0.221116
polarizability: 3.19627553e+02 -2.43624740e-04 1.50788311e+02 2.71369054e-01 1.46117218e-04 7.86404738e+01
1716.lowfreq: -4.3217 -0.0009 -0.0007 -0.0002 1.7026 10.8935 37.8209 48.2047 68.2225
frequency: 37.7782 48.1930 68.2225 77.3444 81.4595 149.1724 191.5701 211.9980 241.5015 245.3415 257.7698 275.4845 385.2837 396.4241 411.7187 414.2959 454.1214 497.6571 507.2528 525.4463 559.1876 563.8054 565.8325 591.2370 626.9046 636.8190 640.2566 701.8479 721.7378 739.0456 811.3925 811.3994 817.4256 819.6452 830.3922 836.5255 932.9803 940.0637 949.6005 950.6514 980.0424 997.1586 1023.8995 1116.4272 1118.0745 1166.3853 1166.9189 1189.0793 1204.8152 1253.8590 1253.8909 1292.5565 1297.4257 1300.7931 1313.8409 1319.9353 1342.7772 1361.8215 1418.3780 1430.3320 1454.8574 1470.2141 1494.5640 1530.5599 1570.2043 1582.7459 1627.5462 1632.0155 1671.4906 1671.5053 3109.8221 3111.3384 3122.1655 3125.8938 3138.1555 3142.0693 3148.9956 3151.3037 3397.2535 3397.3907 3517.8470 3517.9681 3565.6576 3566.0110
redmass: 4.5011 4.0293 3.3558 5.2287 4.9634 6.0838 4.1732 4.8076 1.3145 1.1086 2.8413 4.1517 5.7175 5.0100 2.9440 2.9461 4.5768 2.1378 3.5440 1.5399 1.1977 1.6728 1.3144 1.5883 4.0485 4.3846 6.1754 5.1554 3.3129 3.5032 1.4334 1.3363 2.2604 2.2515 3.0288 2.2705 1.3412 1.3997 1.3554 1.3572 5.3080 2.7913 2.4464 1.7255 1.4708 2.3746 2.5154 1.2237 1.2240 1.1661 1.1661 2.4045 1.4033 1.3511 2.6791 2.4827 4.2558 4.3355 2.9510 4.1669 1.5158 1.6631 2.7642 3.3657 4.4354 5.5694 5.6140 5.4170 1.0950 1.0955 1.0869 1.0873 1.0867 1.0861 1.0955 1.0943 1.0954 1.0955 1.0402 1.0402 1.1032 1.1032 1.0781 1.0782
irintensity: 3.7053 0.6016 0.2699 11.6966 0.0957 0.2605 2.0521 1.5653 0.2447 0.6021 21.8537 1.2364 0.0407 0.9221 2.1361 0.0664 11.2606 26.5313 8.5167 3.1346 351.2009 394.6835 26.2290 0.9877 124.9023 116.5164 0.3294 2.5800 9.7464 0.0311 69.4847 0.1510 33.4883 24.6886 11.8048 2.1653 0.2184 0.1287 0.3236 0.0010 0.1925 0.1285 0.4820 15.3053 1.3274 12.3809 3.2443 54.7623 0.0540 0.2538 0.3799 0.2798 3.7371 7.3945 11.7373 150.4292 12.5664 55.9542 10.9533 6.5885 1.2231 12.2810 501.9712 0.1147 0.0836 0.1733 0.0553 301.4438 20.1665 20.4076 43.3985 7.2768 29.9912 0.7285 6.6195 51.1778 5.3462 11.2329 20.2544 9.9901 0.0963 0.0838 133.1929 2.9155
temp: 298.150 k
press: 1.00000 atm
elementType: 7 7 7 7 6 6 6 6 6 6 6 6 6 6 6 6 1 1 1 1 1 1 1 1 1 1 1 1 1 1
symmnumber: 1
zpe: 638750.7 jmol-1
zpe.correction: 0.243287 hartree
zpe.thermalcorrener: 0.258437 hartree
zpe.thermalcorrenthalpy: 0.259381 hartree
zpe.thermalcorrgfe: 0.200513 hartree
zpe.sumelectzpe: -683.475331 hartree
zpe.sumelectthermal: -683.460182 hartree
zpe.sumelectthermalent: -683.459237 hartree
zpe.sumelectthermalfe: -683.518106 hartree
dipole: 0.0004 -1.0208 0.0001
dipole: 1.0208
quadrupole: -83.8803 -78.5865 -97.8417
quadrupole: -0.0007 -0.7623 -0.0001
quadrupole: 2.8892 8.1830 -11.0722 -0.0007 -0.7623 -0.0001
hfenergy: -683.7186184 hartree
pointgroup: C01 [X(C12H14N4)]
dipole: -0.0001752 -0.4015983 -0.0000239 debye
polarizability: 319.5505283|0.000327|150.7883113|-4.3161992|-0.0000567|78.7174981 unknown
InChI: InChI=1S/C12H14N4/c13-15-11-5-1-9(2-6-11)10-3-7-12(16-14)8-4-10/h1-8,15-16H,13-14H2
charge 0 multiplicity 1
30 atoms
N  5.030874 0.249543 -0.003159
N  -5.030845 0.249535 0.003209
N  5.855548 -0.858385 -0.254767
N  -5.855497 -0.858387 0.254786
C  0.743701 0.219723 -0.00152
C  -0.743669 0.219722 0.001558
C  1.489736 1.391539 0.318105
C  -1.489705 1.391535 -0.318068
C  1.489484 -0.947447 -0.322508
C  -1.489449 -0.94745 0.32255
C  3.626053 0.220164 -0.005813
C  -3.626018 0.220157 0.005856
C  2.894334 1.400355 0.317327
C  -2.894305 1.400348 -0.317289
C  2.898488 -0.959919 -0.326241
C  -2.898452 -0.959924 0.326285
H  0.958731 2.306711 0.604671
H  -0.958702 2.306708 -0.604637
H  0.957449 -1.862434 -0.60854
H  -0.957411 -1.862436 0.608583
H  3.43512 2.318856 0.579751
H  -3.435092 2.318848 -0.579713
H  3.434045 -1.878071 -0.590595
H  -3.434019 -1.87807 0.59064
H  5.517598 1.108511 0.248662
H  -5.517547 1.108508 -0.248646
H  5.818608 -1.190133 -1.226213
H  5.76497 -1.611458 0.438924
H  -5.818703 -1.190112 1.226235
H  -5.765025 -1.611435 -0.438932
