program: Gaussian 09
title: 000111050
version: EM64L-G09RevD.01
frameworkgroup: C1[X(C16H20N2O4)]
method: RPBEPBE
basis: SDD
operation: Freq
keyword: #p
keyword: freq=noraman
keyword: PBEPBE/SDD
title: #p freq=noraman PBEPBE/SDD
converged: YES YES NO NO
title: Mulliken charges:
elementType: O O O O N N C C C C C C C C C C C C C C C C H H H H H H H H H H H H H H H H H H H H
charge: -0.327383 -0.427934 -0.232528 -0.309406 -0.405203 -0.412387 -0.592367 0.398277 -0.149943 0.103850 0.337920 0.232296 -0.425161 -0.375460 -0.716090 -0.703221 -0.710018 0.156733 0.310429 -0.353918 -0.270374 -0.220276 0.242594 0.262736 0.291586 0.281409 0.363262 0.304743 0.237393 0.218123 0.210493 0.268418 0.228038 0.229455 0.202585 0.269833 0.208117 0.219961 0.226448 0.218203 0.220796 0.387971
chargesum: 0.00000
title: Mulliken charges with hydrogens summed into heavy atoms:
elementType: O O O O N N C C C C C C C C C C C C C C C C
charge: -0.327383 -0.039962 -0.232528 -0.309406 -0.041941 -0.107644 -0.087038 0.398277 0.141643 0.103850 0.337920 0.232296 -0.143752 -0.138067 -0.019057 -0.043143 -0.012107 0.156733 0.310429 -0.127470 -0.052171 0.000520
polarizability: 2.27970338e+02 2.28158504e+01 2.19372075e+02 -1.37726718e+01 1.98128048e+01 1.42075340e+02
1716.lowfreq: 0.0004 0.0006 0.0008 2.7978 5.0414 10.4485 14.4072 28.5599 33.0159
frequency: 12.6699 28.4346 32.9613 44.9657 54.4338 64.4768 75.6423 97.3591 118.1791 133.8546 174.9647 183.1460 205.7170 220.2236 238.2313 250.0887 254.7484 282.6666 299.4787 310.8211 331.6204 342.7451 403.6040 421.8276 433.4140 437.4525 455.4253 461.4681 511.5968 523.6281 533.1493 552.4156 563.1072 573.3209 577.5735 612.7967 648.1443 685.1505 698.3852 705.1123 711.4625 747.4253 749.9822 751.6979 774.2089 807.4940 825.8291 847.9305 852.5774 868.1082 912.7025 915.3806 920.9869 931.5111 955.4430 955.8223 969.9783 988.4882 1012.5668 1031.3569 1033.5678 1059.8449 1083.8536 1096.6142 1132.5887 1136.3437 1164.5723 1168.6191 1185.6534 1217.6376 1233.1553 1240.7341 1257.1706 1258.7476 1270.8608 1291.6903 1298.2740 1327.2352 1347.8490 1354.8309 1371.9449 1377.4852 1392.7505 1398.7847 1423.3705 1444.7974 1458.3591 1465.9290 1467.1325 1468.0708 1469.9095 1475.3889 1479.7143 1483.5273 1502.6101 1557.9283 1586.0731 1629.4929 1631.7851 1666.5819 2986.7024 2989.7083 2994.5027 3004.7796 3015.5110 3072.5856 3077.9663 3083.0847 3096.1994 3098.3010 3112.1142 3116.4661 3123.3948 3133.2669 3149.2061 3163.3532 3220.4291 3525.0740 3575.4052 3612.3306
redmass: 4.8107 4.8200 3.6081 7.2641 5.4031 7.4344 5.1807 4.8631 4.1050 5.7357 4.2561 1.1027 4.6457 4.0822 1.0584 3.2813 1.0719 4.1122 3.4186 5.1718 2.6263 3.8841 2.7885 2.8413 2.8564 3.0979 3.4385 2.8160 2.6535 1.6794 3.4281 4.8794 3.3354 1.2462 2.4601 2.1301 2.1946 5.0099 6.8782 8.6778 5.3466 1.6191 3.1335 4.1449 3.0274 1.8876 2.6057 1.8619 2.3680 4.8893 3.9784 1.5988 1.6185 1.3817 1.2114 2.4378 1.2999 6.4801 2.1567 1.4240 1.4201 2.9441 2.3994 1.5900 1.8552 2.0388 1.6665 1.3136 1.3180 1.8844 1.5525 2.2197 2.8024 1.4606 2.9423 1.8134 1.8710 2.2115 1.4206 1.7960 1.2283 1.2308 5.1993 1.2179 2.3172 1.0484 3.7113 1.1210 1.0825 1.0872 1.0538 1.9184 1.0540 3.0858 1.0638 6.0359 6.1477 8.8194 6.9327 8.9986 1.0360 1.0357 1.0362 1.0736 1.0691 1.1029 1.0994 1.0991 1.0993 1.1004 1.0999 1.0995 1.0848 1.0894 1.0947 1.0999 1.0986 1.0643 1.0778 1.0809
irintensity: 0.8493 1.2720 0.4529 2.3232 2.8924 2.7692 3.5122 0.1938 1.4468 0.2391 2.8956 0.2743 4.4720 8.3805 0.0489 2.8135 0.1195 2.2928 2.1215 10.3531 1.4646 2.5548 0.1592 15.1864 3.3105 7.5760 2.1361 7.6506 9.1564 95.0069 37.6002 23.0882 19.4551 119.1417 11.5047 50.3517 84.9111 17.0225 9.5935 47.3940 9.4370 67.3677 21.6346 11.8995 19.1684 12.9295 8.6667 2.7931 3.0191 1.5466 4.6161 0.7669 0.9656 2.0492 1.2151 46.7215 0.0320 194.0150 8.5570 2.9437 5.5476 99.6743 103.1194 46.2134 24.7431 57.8164 235.6512 84.7556 1.5119 31.4418 13.1335 11.2310 30.6285 4.9863 22.6394 25.6997 18.3842 35.2186 9.2682 21.9829 39.2965 42.4859 34.2424 38.7261 4.2812 0.9787 4.6892 15.5992 12.1987 45.7482 3.5913 368.2547 4.5026 1.4859 58.4998 6.7314 0.2832 216.4771 1.6767 188.3744 25.1861 12.8319 29.7457 9.8732 21.8518 7.7965 21.6054 19.6447 59.6719 30.3490 4.9458 14.9557 0.1160 11.4923 38.2831 22.7689 0.1251 29.3974 60.9450 61.8938
temp: 298.150 k
press: 1.00000 atm
elementType: 8 8 8 8 7 7 6 6 6 6 6 6 6 6 6 6 6 6 6 6 6 6 1 1 1 1 1 1 1 1 1 1 1 1 1 1 1 1 1 1 1 1
symmnumber: 1
zpe: 886120.7 jmol-1
zpe.correction: 0.337506 hartree
zpe.thermalcorrener: 0.359478 hartree
zpe.thermalcorrenthalpy: 0.360422 hartree
zpe.thermalcorrgfe: 0.284364 hartree
zpe.sumelectzpe: -1030.510784 hartree
zpe.sumelectthermal: -1030.488812 hartree
zpe.sumelectthermalent: -1030.487868 hartree
zpe.sumelectthermalfe: -1030.563925 hartree
dipole: -1.7694 1.2669 2.9284
dipole: 3.6484
quadrupole: -103.7950 -132.1216 -130.6274
quadrupole: 2.9711 -4.4772 -4.0660
quadrupole: 18.3863 -9.9402 -8.4461 2.9711 -4.4772 -4.0660
hfenergy: -1030.8482896 hartree
pointgroup: C01 [X(C16H20N2O4)]
dipole: -0.7245212 0.4655664 1.148341 debye
polarizability: 224.1125295|23.0191105|223.7138584|-16.3665542|16.8472547|141.5913649 unknown
InChI: InChI=1S/C16H20N2O4/c1-16(2,3)22-15(21)18-13(14(19)20)8-10-9-17-12-7-5-4-6-11(10)12/h4-7,9,13,17-19H,8H2,1-3H3
charge 0 multiplicity 1
42 atoms
O  2.670802 0.170748 0.620654
O  -0.639968 -2.589746 1.988719
O  -1.534522 -3.949139 0.333547
O  2.39532 -1.039089 -1.411924
N  0.900487 -1.215105 0.375247
N  -3.954293 0.154067 0.124119
C  -0.941844 -1.507781 -1.357259
C  -1.977422 -0.593974 -0.755134
C  0.037201 -2.170616 -0.314697
C  -1.834142 0.814883 -0.416395
C  3.93749 0.889402 0.178072
C  -3.091156 1.256589 0.133096
C  -3.283113 -0.953652 -0.412942
C  -0.773889 1.753526 -0.536831
C  3.621778 1.774832 -1.044738
C  4.26684 1.738246 1.41836
C  5.042558 -0.146647 -0.110259
C  -0.779076 -3.009353 0.659624
C  2.02692 -0.721048 -0.244647
C  -3.308441 2.584953 0.562181
C  -0.984786 3.079663 -0.114508
C  -2.237233 3.491515 0.432029
H  -1.429753 -2.335239 -1.903307
H  -0.299647 -0.968847 -2.076954
H  0.680181 -2.861881 -0.894401
H  -3.778877 -1.916894 -0.523257
H  0.660508 -0.900875 1.316207
H  -4.92284 0.160811 0.435235
H  0.192301 1.452817 -0.955564
H  2.785397 2.459941 -0.815595
H  4.507705 2.386343 -1.295857
H  3.357403 1.159723 -1.919332
H  4.432877 1.091806 2.297265
H  3.437262 2.429624 1.646183
H  5.18177 2.330252 1.237271
H  4.781695 -0.767383 -0.981651
H  5.994187 0.376852 -0.316497
H  5.19274 -0.80177 0.766275
H  -4.270148 2.905857 0.978424
H  -0.175902 3.81345 -0.204808
H  -2.368434 4.530793 0.753585
H  -1.224638 -3.142154 2.574161
