program: Gaussian 09
title: 000111025
version: EM64L-G09RevD.01
frameworkgroup: C1[X(C11H16O4)]
method: RPBEPBE
basis: SDD
operation: Freq
keyword: #pfreq=noraman
keyword: PBEPBE/SDD
title: #p freq=noraman PBEPBE/SDD
converged: YES YES NO NO
title: Mulliken charges:
elementType: O O O O C C C C C C C C C C C H H H H H H H H H H H H H H H H
charge: -0.252621 -0.254746 -0.250580 -0.252235 0.002085 -0.277829 -0.545298 0.210821 0.243721 -0.006947 -0.599906 -0.222623 -0.220853 -0.674008 -0.672883 0.291663 0.268943 0.280783 0.232774 0.220742 0.216614 0.227364 0.230492 0.228333 0.231541 0.228126 0.210905 0.232813 0.211902 0.229062 0.231845
chargesum: 0.00000
title: Mulliken charges with hydrogens summed into heavy atoms:
elementType: O O O O C C C C C C C C C C C
charge: -0.252621 -0.254746 -0.250580 -0.252235 0.002085 0.013834 0.004427 0.210821 0.243721 0.225827 -0.162550 0.235233 0.239022 -0.002164 -0.000075
polarizability: 1.59802032e+02 3.82069862e+00 1.27313797e+02 9.11617335e+00 2.57608166e+00 1.14478661e+02
1716.lowfreq: -7.5509 -6.3214 -0.0007 -0.0006 -0.0005 5.2572 22.5296 24.5131 54.1782
frequency: 22.4938 24.4792 54.1747 58.7769 68.9345 74.1645 94.2069 109.8074 125.4027 158.0675 181.2783 224.3197 242.8731 257.9901 267.8926 286.7514 326.4778 344.7374 358.2546 387.4946 405.1136 465.5354 488.9829 639.9738 688.3816 700.6342 753.7542 782.6816 796.8246 798.3863 799.3419 809.9650 830.7008 864.5415 925.7430 940.4689 962.4924 994.1449 1005.5924 1021.8248 1031.0835 1053.7946 1079.5419 1102.1158 1112.7933 1113.7929 1134.4273 1134.6212 1162.5495 1206.5255 1247.9925 1248.9365 1250.1382 1288.6230 1297.9988 1333.8957 1360.0093 1362.9672 1399.6350 1400.9449 1436.7362 1447.4313 1461.8079 1463.1615 1471.6891 1473.7385 1485.5604 1485.7940 1607.5731 1622.1018 1654.7995 2995.9975 2996.3256 3010.0969 3011.4351 3068.8448 3070.4862 3092.5120 3092.8184 3093.2291 3105.1278 3106.7065 3107.8285 3108.1468 3131.8070 3203.8466 3218.5759
redmass: 3.8890 2.8873 4.0319 3.4631 3.0641 2.4106 5.4568 2.3091 3.8318 2.7110 2.2232 2.2739 1.3474 1.8795 3.5739 4.0187 2.6369 3.5023 3.4867 3.4066 4.7170 4.8062 4.7062 2.6795 3.3307 7.2067 3.7334 6.1081 1.8607 1.1169 1.6751 2.8570 2.8611 3.2503 1.9513 1.3115 1.3976 2.8261 1.1553 2.2072 2.6520 1.6814 1.3806 2.2471 2.2189 2.2132 1.4650 1.4627 3.6149 2.0908 1.3791 1.1481 1.7163 1.4253 2.2715 1.7700 1.5007 1.5473 1.2764 1.2742 1.1417 1.3431 1.0402 1.0400 1.0594 1.0636 1.0691 1.0679 11.7974 10.5298 4.6511 1.0358 1.0358 1.0581 1.0581 1.1066 1.1065 1.0622 1.0985 1.0986 1.0893 1.0583 1.1027 1.1024 1.0899 1.1145 1.1169
irintensity: 1.4563 0.1823 0.2340 1.4305 0.2005 0.7212 0.5842 2.2206 1.7634 0.0690 4.6509 6.5019 0.3668 5.4803 3.3185 8.8509 4.4394 8.4176 5.1342 6.2149 3.9612 13.4978 5.4673 0.2616 13.1552 6.0485 19.5021 20.4987 3.1414 4.8486 4.2139 15.4205 9.3143 2.1113 7.1654 84.1184 26.7320 4.7960 11.5607 47.4528 55.0324 58.0161 9.9117 137.9132 9.5174 5.4901 4.4316 9.0300 378.2132 82.1379 71.3119 4.0945 142.7796 62.5643 117.4403 32.0909 15.3059 5.5509 11.0773 24.1645 5.3014 15.0401 17.1637 6.8719 5.5904 1.8639 9.3145 16.3380 314.7920 55.8043 17.0195 30.5658 9.9444 21.0310 17.9374 7.1538 6.7638 5.3676 20.3562 42.5041 5.7489 3.3270 19.5967 67.1755 0.2976 20.0272 0.7712
temp: 298.150 k
press: 1.00000 atm
elementType: 8 8 8 8 6 6 6 6 6 6 6 6 6 6 6 1 1 1 1 1 1 1 1 1 1 1 1 1 1 1 1
symmnumber: 1
zpe: 656093.2 jmol-1
zpe.correction: 0.249893 hartree
zpe.thermalcorrener: 0.267349 hartree
zpe.thermalcorrenthalpy: 0.268293 hartree
zpe.thermalcorrgfe: 0.202268 hartree
zpe.sumelectzpe: -728.457187 hartree
zpe.sumelectthermal: -728.439731 hartree
zpe.sumelectthermalent: -728.438787 hartree
zpe.sumelectthermalfe: -728.504812 hartree
dipole: 1.8902 1.4604 -0.7169
dipole: 2.4939
quadrupole: -77.7331 -84.8451 -94.0668
quadrupole: -0.1630 2.1086 -6.0384
quadrupole: 7.8153 0.7032 -8.5185 -0.1630 2.1086 -6.0384
hfenergy: -728.7070799 hartree
pointgroup: C01 [X(C11H16O4)]
dipole: 0.3566585 -0.8838038 0.2331632 debye
polarizability: 150.5064879|-15.7864437|136.4142074|-4.7669049|7.2299675|114.6737953 unknown
InChI: InChI=1S/C11H16O4/c1-4-8-7-11(8,9(12)14-5-2)10(13)15-6-3/h4,8H,1,5-7H2,2-3H3
charge 0 multiplicity 1
31 atoms
O  -0.629748 -1.353915 -0.07169
O  1.966706 -0.16963 -0.014732
O  -1.267226 -0.359193 -2.077546
O  1.558407 1.757382 1.227151
C  -0.117393 0.960373 -0.36214
C  -1.152032 2.034092 0.17576
C  -0.380567 2.283406 -1.113881
C  -0.700779 -0.289275 -0.95824
C  1.180377 0.899736 0.390476
C  -2.610107 1.748207 0.157223
C  -3.455472 2.087482 1.164405
C  -1.189673 -2.651646 -0.560879
C  3.295608 -0.299062 0.662957
C  -0.955019 -3.67331 0.546248
C  3.95372 -1.551817 0.095742
H  -0.770173 2.544372 1.067228
H  0.421613 3.025316 -1.095163
H  -0.912437 2.173566 -2.063266
H  -3.003574 1.254499 -0.743377
H  -3.098659 2.585983 2.074073
H  -4.528908 1.879819 1.10286
H  -2.261798 -2.503392 -0.784054
H  -0.674862 -2.916727 -1.501982
H  3.878045 0.618001 0.460668
H  3.1217 -0.364344 1.752014
H  0.122653 -3.784107 0.755779
H  -1.354252 -4.657108 0.238934
H  -1.46089 -3.367855 1.477908
H  4.944246 -1.698732 0.563657
H  3.337191 -2.444381 0.297542
H  4.093803 -1.46474 -0.995174
