program: Gaussian 09
title: 000002337
version: EM64L-G09RevD.01
frameworkgroup: C1[X(C9H11NO2)]
method: RPBEPBE
basis: SDD
operation: Freq
keyword: #p
keyword: freq=noraman
keyword: PBEPBE/SDD
title: #p freq=noraman PBEPBE/SDD
converged: YES YES NO YES
title: Mulliken charges:
elementType: O O N C C C C C C C C C H H H H H H H H H H H
charge: -0.296193 -0.273638 -0.685087 0.229775 -0.337685 -0.324455 0.499923 -0.404671 -0.400078 0.179814 -0.217199 -0.677262 0.265238 0.265505 0.220583 0.218822 0.225617 0.225611 0.209273 0.227777 0.227778 0.310038 0.310515
chargesum: 0.00000
title: Mulliken charges with hydrogens summed into heavy atoms:
elementType: O O N C C C C C C C C C
charge: -0.296193 -0.273638 -0.064534 0.229775 -0.072447 -0.058950 0.499923 -0.184089 -0.181256 0.179814 0.234029 -0.012434
polarizability: 1.90865609e+02 -9.04811042e+00 1.13458372e+02 3.11238338e-03 1.90125134e-03 5.51646325e+01
1716.lowfreq: -0.0007 -0.0004 0.0008 6.0088 9.4975 14.9865 47.9173 74.3760 88.6550
frequency: 47.5162 74.2717 88.6068 97.3165 140.5162 231.9961 244.6567 295.5244 298.7222 356.0387 371.9994 409.0169 412.6674 416.5798 484.6383 508.1447 606.1921 634.4759 677.8715 754.7327 777.7844 799.7816 821.1751 825.0561 843.6910 851.2098 974.0027 984.4323 997.1797 1016.5697 1026.2010 1060.7045 1111.7586 1130.4459 1136.9281 1180.5882 1248.3500 1254.5041 1308.7090 1325.3802 1361.4183 1392.1891 1401.0268 1448.9208 1463.7704 1474.7955 1487.5587 1517.9637 1570.6114 1611.2262 1632.6288 1646.6418 2994.2072 3006.4319 3063.0479 3090.2360 3105.3031 3122.6016 3125.4441 3158.5966 3172.8693 3560.7968 3700.2742
redmass: 2.9278 2.3952 6.2863 3.8903 3.0513 4.5875 1.2638 4.3939 5.2220 4.9714 2.8462 1.1292 1.2539 2.2450 4.7828 2.8256 6.6256 6.9005 4.0215 4.4059 6.0680 1.1025 4.6982 1.2632 1.8450 4.1883 1.3607 1.3505 3.2659 1.5467 2.1082 5.0843 2.2067 1.2153 1.4690 1.1316 1.1320 2.9348 1.3174 2.9009 1.4550 4.8284 1.2764 4.2529 1.0406 1.0578 1.0732 3.1929 7.3172 10.0270 3.0929 1.4701 1.0359 1.0582 1.1065 1.0984 1.1023 1.0895 1.0893 1.0953 1.0948 1.0451 1.1039
irintensity: 0.5743 4.6172 0.2893 2.7669 0.4782 3.9108 0.0061 10.4247 3.9564 10.5486 0.6125 42.3816 275.2544 2.3424 3.5868 3.3644 11.2378 1.8467 27.5042 13.1582 13.5999 1.7739 2.2168 0.4978 75.1894 6.1971 0.2678 0.1844 20.9035 2.4390 17.4223 402.4354 2.2676 14.0955 5.3283 166.5260 0.0145 347.9908 2.1315 102.1768 16.5842 11.2527 19.3257 6.2611 11.5626 5.5447 15.2803 71.6710 31.4630 356.9192 84.3952 316.8080 24.7987 26.9249 10.8226 35.6003 48.4199 16.2303 21.3763 8.9791 3.7963 105.0339 22.9917
temp: 298.150 k
press: 1.00000 atm
elementType: 8 8 7 6 6 6 6 6 6 6 6 6 1 1 1 1 1 1 1 1 1 1 1
symmnumber: 1
zpe: 484095.8 jmol-1
zpe.correction: 0.184382 hartree
zpe.thermalcorrener: 0.196251 hartree
zpe.thermalcorrenthalpy: 0.197195 hartree
zpe.thermalcorrgfe: 0.146054 hartree
zpe.sumelectzpe: -553.886895 hartree
zpe.sumelectthermal: -553.875026 hartree
zpe.sumelectthermalent: -553.874082 hartree
zpe.sumelectthermalfe: -553.925223 hartree
dipole: 3.3851 -2.7723 0.0003
dipole: 4.3754
quadrupole: -39.8050 -70.5095 -74.4822
quadrupole: 1.8319 0.0016 0.0000
quadrupole: 21.7939 -8.9106 -12.8833 1.8319 0.0016 0.0000
hfenergy: -554.0712769 hartree
pointgroup: C01 [X(C9H11N1O2)]
dipole: 1.3451385 -1.0742091 0.000524 debye
dipolederiv: -1.764367 -0.3852115 -0.0000031 -0.8296297 -0.7234421 0.0000233 0.0002431 0.000129 -0.2845651 -0.9306138 0.2660686 -0.0001436 0.2928284 -1.001686 0.0002596 -0.0000635 0.0000872 -0.3349539 -1.730173 0.3595465 -0.0001982 0.3910913 -0.1860071 -0.0000629 -0.0001713 -0.0000753 -0.7313274 -1.1686009 0.1599445 -0.0001606 0.158575 -0.3147074 0.0000739 -0.0001932 0.0000704 -0.0668786 0.5518348 -0.001737 0.0000965 0.165619 0.081418 -0.0000188 0.0000299 -0.0000288 -0.0855308 0.4155342 -0.1660807 0.0001105 -0.3068359 0.1947662 -0.0001016 0.0001126 -0.0000776 -0.0854314 1.7819808 -0.3802223 0.0003162 -0.408705 0.1749645 -0.0000615 0.0003344 -0.0000599 0.1622729 -0.445107 0.10958 -0.0000468 0.6437525 -0.112738 0.0000717 -0.0001758 -0.000009 -0.2393569 -0.694207 0.1561976 -0.0000951 -0.3702239 0.1162346 -0.0001334 0.0000008 -0.0000509 -0.2389763 2.508388 -0.1268652 0.0002616 0.2984252 1.3400473 -0.000307 0.0000703 -0.0002419 0.2282688 1.085277 0.1609383 -0.0000031 0.0595829 0.2633736 0.0000262 -0.0000148 0.0000157 0.3600444 -0.0660263 -0.0965566 0.0000172 -0.073189 -0.0506702 0.0000336 0.0000159 0.0000316 0.0645606 0.1256939 0.0564436 -0.0000187 0.016253 -0.0193765 0.0000406 -0.0000083 0.0000457 0.1485809 0.0778048 -0.0829811 0.0000011 -0.0888083 0.0245416 0.0000136 0.0000038 0.0000112 0.1461249 -0.0766389 -0.1103213 -0.0000132 -0.093416 -0.0122119 0.0000224 -0.0000119 0.0000173 0.1694606 0.0183432 0.0859833 -0.0000397 0.080672 -0.1070713 0.0000715 -0.000034 0.0000746 0.1676919 -0.0838868 -0.0323319 0.0078345 0.0537762 -0.0001394 -0.095722 0.0544072 -0.0923389 -0.0661794 -0.0838962 -0.0323304 -0.0078338 0.0537522 -0.0000413 0.0956946 -0.0544453 0.0923106 -0.0662891 -0.2030999 0.0100403 -0.0000086 0.0289522 0.0705233 0.0000103 -0.0000069 0.0000122 0.1134787 0.1160054 0.0483322 0.0614026 -0.0109449 0.0058334 -0.0937633 0.0330944 -0.1108802 -0.06784 0.1160059 0.0482972 -0.0614217 -0.010963 0.0059448 0.0937224 -0.0330895 0.1108398 -0.067952 0.2084123 -0.0316548 -0.0000263 -0.0835596 0.1398884 0.0000472 -0.0000372 0.0000633 0.3873936 0.2413366 -0.0150795 -0.0000276 0.0329954 0.1105555 0.0000595 -0.0000607 0.000054 0.3874035 unknown
polarizability: 191.0766852|-8.0922602|113.2472902|0.018478|-0.0140764|55.1646378 unknown
InChI: InChI=1S/C9H11NO2/c1-2-12-9(11)7-3-5-8(10)6-4-7/h3-6H,2,10H2,1H3
charge 0 multiplicity 1
23 atoms
O  -2.165008 -0.409892 -0.000529
O  -1.733763 1.884337 -0.000966
N  4.250251 -0.688975 0.000369
C  0.123092 0.302493 -0.000512
C  1.114199 1.32219 -0.000562
C  0.540186 -1.056671 -0.000148
C  2.898209 -0.364025 0.000088
C  2.478464 1.001769 -0.000273
C  1.902859 -1.388865 0.000143
C  -1.301103 0.70047 -0.000832
C  -3.620213 -0.090731 -0.000595
C  -4.363964 -1.422995 -0.000229
H  0.783809 2.366456 -0.000842
H  -0.220256 -1.842715 -0.000108
H  3.231349 1.799293 -0.000323
H  2.211724 -2.441399 0.000419
H  -3.845982 0.520145 0.892623
H  -3.846003 0.519661 -0.894139
H  -5.454774 -1.243583 -0.000281
H  -4.109743 -2.016358 -0.895325
H  -4.109749 -2.015868 0.895193
H  4.554885 -1.658302 0.000664
H  4.961229 0.036966 0.000367
